BDBM50341189 CHEMBL1760896::trans-N-(7-(N-ethylacetamido)-4-methoxybenzo[d]thiazol-2-yl)-4-(3-(trifluoromethyl)phenylsulfonamido)cyclohexanecarboxamide
SMILES: CCN(C(C)=O)c1ccc(OC)c2nc(NC(=O)[C@H]3CC[C@@H](CC3)NS(=O)(=O)c3cccc(c3)C(F)(F)F)sc12
InChI Key: InChIKey=AEALLVSFYNMBHG-SAABIXHNSA-N
Data: 2 KI  1 IC50
Activity Spreadsheet -- Enzyme Inhibition Constant Data from BindingDB
Found 3 hits for monomerid = 50341189
Trg + Lig
Ki
nM
ΔG°
kcal/mole
IC50
nM
Kd
nM
EC50/IC50
nM
koff
s-1
kon
M-1s-1
pHTemp
°C
Adenosine receptor A1
(Homo sapiens (Human))
BDBM50341189
(CHEMBL1760896 | trans-N-(7-(N-ethylacetamido)-4-me...)
Show SMILES CCN(C(C)=O)c1ccc(OC)c2nc(NC(=O)[C@H]3CC[C@@H](CC3)NS(=O)(=O)c3cccc(c3)C(F)(F)F)sc12 |r,wU:18.17,wD:21.24,(10.57,-46.93,;10.57,-45.39,;11.9,-44.62,;13.23,-45.39,;14.57,-44.62,;13.24,-46.93,;11.9,-43.08,;10.57,-42.31,;10.57,-40.76,;11.9,-39.99,;11.89,-38.45,;13.22,-37.68,;13.23,-40.76,;14.71,-40.28,;15.62,-41.53,;17.16,-41.53,;17.93,-40.2,;17.16,-38.86,;19.46,-40.19,;20.23,-38.85,;21.77,-38.86,;22.54,-40.2,;21.76,-41.53,;20.23,-41.52,;24.08,-40.2,;24.85,-41.54,;23.5,-42.3,;24.83,-43.07,;26.38,-41.53,;27.14,-42.85,;28.67,-42.85,;29.43,-41.52,;28.65,-40.19,;27.12,-40.21,;29.41,-38.86,;30.95,-38.84,;28.63,-37.53,;30.17,-37.51,;14.71,-42.78,;13.23,-42.31,)|
Show InChI InChI=1S/C26H29F3N4O5S2/c1-4-33(15(2)34)20-12-13-21(38-3)22-23(20)39-25(30-22)31-24(35)16-8-10-18(11-9-16)32-40(36,37)19-7-5-6-17(14-19)26(27,28)29/h5-7,12-14,16,18,32H,4,8-11H2,1-3H3,(H,30,31,35)/t16-,18-
Reactome pathway
6n/an/an/an/an/an/an/an/a
Roche Research Center
Curated by ChEMBL
Assay Description
Displacement of [3H]-DPCPX from human adenosine A1 receptor after 1 hr
Bioorg Med Chem Lett 21: 1933-6 (2011)
Article DOI: 10.1016/j.bmcl.2011.02.053
BindingDB Entry DOI: 10.7270/Q2959HWD
Adenosine receptor A2a
(Homo sapiens (Human))
BDBM50341189
(CHEMBL1760896 | trans-N-(7-(N-ethylacetamido)-4-me...)
Show SMILES CCN(C(C)=O)c1ccc(OC)c2nc(NC(=O)[C@H]3CC[C@@H](CC3)NS(=O)(=O)c3cccc(c3)C(F)(F)F)sc12 |r,wU:18.17,wD:21.24,(10.57,-46.93,;10.57,-45.39,;11.9,-44.62,;13.23,-45.39,;14.57,-44.62,;13.24,-46.93,;11.9,-43.08,;10.57,-42.31,;10.57,-40.76,;11.9,-39.99,;11.89,-38.45,;13.22,-37.68,;13.23,-40.76,;14.71,-40.28,;15.62,-41.53,;17.16,-41.53,;17.93,-40.2,;17.16,-38.86,;19.46,-40.19,;20.23,-38.85,;21.77,-38.86,;22.54,-40.2,;21.76,-41.53,;20.23,-41.52,;24.08,-40.2,;24.85,-41.54,;23.5,-42.3,;24.83,-43.07,;26.38,-41.53,;27.14,-42.85,;28.67,-42.85,;29.43,-41.52,;28.65,-40.19,;27.12,-40.21,;29.41,-38.86,;30.95,-38.84,;28.63,-37.53,;30.17,-37.51,;14.71,-42.78,;13.23,-42.31,)|
Show InChI InChI=1S/C26H29F3N4O5S2/c1-4-33(15(2)34)20-12-13-21(38-3)22-23(20)39-25(30-22)31-24(35)16-8-10-18(11-9-16)32-40(36,37)19-7-5-6-17(14-19)26(27,28)29/h5-7,12-14,16,18,32H,4,8-11H2,1-3H3,(H,30,31,35)/t16-,18-
NCI pathway
Reactome pathway
200n/an/an/an/an/an/an/an/a
Roche Research Center
Curated by ChEMBL
Assay Description
Displacement of [3H]ZM241385 from human adenosine A2A receptor after 1 hr
Bioorg Med Chem Lett 21: 1933-6 (2011)
Article DOI: 10.1016/j.bmcl.2011.02.053
BindingDB Entry DOI: 10.7270/Q2959HWD
Adenosine receptor A2b
(Homo sapiens (Human))
BDBM50341189
(CHEMBL1760896 | trans-N-(7-(N-ethylacetamido)-4-me...)
Show SMILES CCN(C(C)=O)c1ccc(OC)c2nc(NC(=O)[C@H]3CC[C@@H](CC3)NS(=O)(=O)c3cccc(c3)C(F)(F)F)sc12 |r,wU:18.17,wD:21.24,(10.57,-46.93,;10.57,-45.39,;11.9,-44.62,;13.23,-45.39,;14.57,-44.62,;13.24,-46.93,;11.9,-43.08,;10.57,-42.31,;10.57,-40.76,;11.9,-39.99,;11.89,-38.45,;13.22,-37.68,;13.23,-40.76,;14.71,-40.28,;15.62,-41.53,;17.16,-41.53,;17.93,-40.2,;17.16,-38.86,;19.46,-40.19,;20.23,-38.85,;21.77,-38.86,;22.54,-40.2,;21.76,-41.53,;20.23,-41.52,;24.08,-40.2,;24.85,-41.54,;23.5,-42.3,;24.83,-43.07,;26.38,-41.53,;27.14,-42.85,;28.67,-42.85,;29.43,-41.52,;28.65,-40.19,;27.12,-40.21,;29.41,-38.86,;30.95,-38.84,;28.63,-37.53,;30.17,-37.51,;14.71,-42.78,;13.23,-42.31,)|
Show InChI InChI=1S/C26H29F3N4O5S2/c1-4-33(15(2)34)20-12-13-21(38-3)22-23(20)39-25(30-22)31-24(35)16-8-10-18(11-9-16)32-40(36,37)19-7-5-6-17(14-19)26(27,28)29/h5-7,12-14,16,18,32H,4,8-11H2,1-3H3,(H,30,31,35)/t16-,18-
NCI pathway
Reactome pathway
n/an/a 13n/an/an/an/an/an/a
Roche Research Center
Curated by ChEMBL
Assay Description
Inhibition of human adenosine A2B receptor expressed in CHO cells assessed as decrease in cellular cAMP level after 20 to 25 mins
Bioorg Med Chem Lett 21: 1933-6 (2011)
Article DOI: 10.1016/j.bmcl.2011.02.053
BindingDB Entry DOI: 10.7270/Q2959HWD