BDBM50341354 2-[(1,1-Dioxidotetrahydro-2H-thiopyran-4-yl)amino]-6-(2,4-difluorophenoxy)-8-methylpyrido[2,3-d]pyrimidin-7(8H)-one::CHEMBL1766581
SMILES: Cn1c2nc(NC3CCS(=O)(=O)CC3)ncc2cc(Oc2ccc(F)cc2F)c1=O
InChI Key: InChIKey=GJXDFKISKKIETP-UHFFFAOYSA-N
Data: 1 IC50
Activity Spreadsheet -- Enzyme Inhibition Constant Data from BindingDB
Found 1 hit for monomerid = 50341354
Trg + Lig
Ki
nM
ΔG°
kcal/mole
IC50
nM
Kd
nM
EC50/IC50
nM
koff
s-1
kon
M-1s-1
pHTemp
°C
Mitogen-activated protein kinase 14
(Homo sapiens (Human))
BDBM50341354
(2-[(1,1-Dioxidotetrahydro-2H-thiopyran-4-yl)amino]...)
Show SMILES Cn1c2nc(NC3CCS(=O)(=O)CC3)ncc2cc(Oc2ccc(F)cc2F)c1=O
Show InChI InChI=1S/C19H18F2N4O4S/c1-25-17-11(8-16(18(25)26)29-15-3-2-12(20)9-14(15)21)10-22-19(24-17)23-13-4-6-30(27,28)7-5-13/h2-3,8-10,13H,4-7H2,1H3,(H,22,23,24)
NCI pathway
Reactome pathway
n/an/a 15n/an/an/an/an/an/a
Roche Palo Alto LLC
Curated by ChEMBL
Assay Description
Inhibition of human recombinant p38alpha assessed as incorporation of 33P from gamma-[33P]ATP into myelin basic protein after 30 mins by scintillatio...
J Med Chem 54: 2255-65 (2011)
Article DOI: 10.1021/jm101423y
BindingDB Entry DOI: 10.7270/Q20P109X