BDBM50341367 6-(2,4-Difluorophenoxy)-8-(2-hydroxy-2-methyl-propyl)-2-(tetrahydropyran-4-ylamino)-8H-pyrido[2,3-d]pyrimidin-7-one::CHEMBL1766504
SMILES: CC(C)(O)Cn1c2nc(NC3CCOCC3)ncc2cc(Oc2ccc(F)cc2F)c1=O
InChI Key: InChIKey=OEDPZABCSWCOMJ-UHFFFAOYSA-N
Data: 1 IC50
Activity Spreadsheet -- Enzyme Inhibition Constant Data from BindingDB
Found 1 hit for monomerid = 50341367
Trg + Lig
Ki
nM
ΔG°
kcal/mole
IC50
nM
Kd
nM
EC50/IC50
nM
koff
s-1
kon
M-1s-1
pHTemp
°C
Mitogen-activated protein kinase 14
(Homo sapiens (Human))
BDBM50341367
(6-(2,4-Difluorophenoxy)-8-(2-hydroxy-2-methyl-prop...)
Show SMILES CC(C)(O)Cn1c2nc(NC3CCOCC3)ncc2cc(Oc2ccc(F)cc2F)c1=O
Show InChI InChI=1S/C22H24F2N4O4/c1-22(2,30)12-28-19-13(11-25-21(27-19)26-15-5-7-31-8-6-15)9-18(20(28)29)32-17-4-3-14(23)10-16(17)24/h3-4,9-11,15,30H,5-8,12H2,1-2H3,(H,25,26,27)
NCI pathway
Reactome pathway
n/an/a 12n/an/an/an/an/an/a
Roche Palo Alto LLC
Curated by ChEMBL
Assay Description
Inhibition of human recombinant p38alpha assessed as incorporation of 33P from gamma-[33P]ATP into myelin basic protein after 30 mins by scintillatio...
J Med Chem 54: 2255-65 (2011)
Article DOI: 10.1021/jm101423y
BindingDB Entry DOI: 10.7270/Q20P109X