BDBM50341720 3-amino-6-(2-(methylsulfinyl)phenyl)-N-phenylpyrazine-2-carboxamide::CHEMBL1766766
SMILES: CS(=O)c1ccccc1-c1cnc(N)c(n1)C(=O)Nc1ccccc1
InChI Key: InChIKey=FCWWTHQCXQLULC-UHFFFAOYSA-N
Data: 3 IC50
Activity Spreadsheet -- Enzyme Inhibition Constant Data from BindingDB
Found 3 hits for monomerid = 50341720
Trg + Lig
Ki
nM
ΔG°
kcal/mole
IC50
nM
Kd
nM
EC50/IC50
nM
koff
s-1
kon
M-1s-1
pHTemp
°C
DNA-dependent protein kinase catalytic subunit
(Homo sapiens (Human))
BDBM50341720
(3-amino-6-(2-(methylsulfinyl)phenyl)-N-phenylpyraz...)
Show SMILES CS(=O)c1ccccc1-c1cnc(N)c(n1)C(=O)Nc1ccccc1
Show InChI InChI=1S/C18H16N4O2S/c1-25(24)15-10-6-5-9-13(15)14-11-20-17(19)16(22-14)18(23)21-12-7-3-2-4-8-12/h2-11H,1H3,(H2,19,20)(H,21,23)
n/an/a 2.00E+3n/an/an/an/an/an/a
Vertex Pharmaceuticals (Europe) Ltd.
Curated by ChEMBL
Assay Description
Inhibition of DNAPK after 2 hrs by radiometric phosphate incorporation assay
J Med Chem 54: 2320-30 (2011)
Article DOI: 10.1021/jm101488z
BindingDB Entry DOI: 10.7270/Q2WS8TK6
Serine-protein kinase ATM
(Homo sapiens (Human))
BDBM50341720
(3-amino-6-(2-(methylsulfinyl)phenyl)-N-phenylpyraz...)
Show SMILES CS(=O)c1ccccc1-c1cnc(N)c(n1)C(=O)Nc1ccccc1
Show InChI InChI=1S/C18H16N4O2S/c1-25(24)15-10-6-5-9-13(15)14-11-20-17(19)16(22-14)18(23)21-12-7-3-2-4-8-12/h2-11H,1H3,(H2,19,20)(H,21,23)
n/an/a 3.00E+3n/an/an/an/an/an/a
Vertex Pharmaceuticals (Europe) Ltd.
Curated by ChEMBL
Assay Description
Inhibition of full length recombinant ATM after 24 hrs by radiometric phosphate incorporation assay
J Med Chem 54: 2320-30 (2011)
Article DOI: 10.1021/jm101488z
BindingDB Entry DOI: 10.7270/Q2WS8TK6
Serine/threonine-protein kinase ATR
(Homo sapiens (Human))
BDBM50341720
(3-amino-6-(2-(methylsulfinyl)phenyl)-N-phenylpyraz...)
Show SMILES CS(=O)c1ccccc1-c1cnc(N)c(n1)C(=O)Nc1ccccc1
Show InChI InChI=1S/C18H16N4O2S/c1-25(24)15-10-6-5-9-13(15)14-11-20-17(19)16(22-14)18(23)21-12-7-3-2-4-8-12/h2-11H,1H3,(H2,19,20)(H,21,23)
Reactome pathway
n/an/a 130n/an/an/an/an/an/a
Vertex Pharmaceuticals (Europe) Ltd.
Curated by ChEMBL
Assay Description
Inhibition of full length recombinant ATR after 24 hrs by radiometric phosphate incorporation assay
J Med Chem 54: 2320-30 (2011)
Article DOI: 10.1021/jm101488z
BindingDB Entry DOI: 10.7270/Q2WS8TK6