BDBM50341727 3-amino-6-(3-(methylsulfonyl)phenyl)-N-phenylpyrazine-2-carboxamide::CHEMBL1766773::US10479784, Compound I-3::US10961232, Compound I-3
SMILES: CS(=O)(=O)c1cccc(c1)-c1cnc(N)c(n1)C(=O)Nc1ccccc1
InChI Key: InChIKey=ISWAJEMQAQNLMY-UHFFFAOYSA-N
Data: 2 KI  3 IC50
Activity Spreadsheet -- Enzyme Inhibition Constant Data from BindingDB
Found 5 hits for monomerid = 50341727
Trg + Lig
Ki
nM
ΔG°
kcal/mole
IC50
nM
Kd
nM
EC50/IC50
nM
koff
s-1
kon
M-1s-1
pHTemp
°C
Serine/threonine-protein kinase ATR
(Homo sapiens (Human))
BDBM50341727
(3-amino-6-(3-(methylsulfonyl)phenyl)-N-phenylpyraz...)
Show SMILES CS(=O)(=O)c1cccc(c1)-c1cnc(N)c(n1)C(=O)Nc1ccccc1
Show InChI InChI=1S/C18H16N4O3S/c1-26(24,25)14-9-5-6-12(10-14)15-11-20-17(19)16(22-15)18(23)21-13-7-3-2-4-8-13/h2-11H,1H3,(H2,19,20)(H,21,23)
Reactome pathway
US Patent
2.55E+3n/an/an/an/an/an/an/an/a
VERTEX PHARMACEUTICALS INCORPORATED
US Patent
Assay Description
Compounds were screened for their ability to inhibit ATR kinase using a radioactive-phosphate incorporation assay. Assays were carried out in a mixtu...
US Patent US10961232 (2021)
Serine/threonine-protein kinase ATR
(Homo sapiens (Human))
BDBM50341727
(3-amino-6-(3-(methylsulfonyl)phenyl)-N-phenylpyraz...)
Show SMILES CS(=O)(=O)c1cccc(c1)-c1cnc(N)c(n1)C(=O)Nc1ccccc1
Show InChI InChI=1S/C18H16N4O3S/c1-26(24,25)14-9-5-6-12(10-14)15-11-20-17(19)16(22-15)18(23)21-13-7-3-2-4-8-13/h2-11H,1H3,(H2,19,20)(H,21,23)
Reactome pathway
US Patent
5.05E+3n/an/an/an/an/an/an/an/a
VERTEX PHARMACEUTICALS INCORPORATED
US Patent
Assay Description
Compounds were screened for their ability to inhibit ATR kinase using a radioactive-phosphate incorporation assay. Assays were carried out in a mixtu...
US Patent US10479784 (2019)
BindingDB Entry DOI: 10.7270/Q2GF0WVD
Serine/threonine-protein kinase ATR
(Homo sapiens (Human))
BDBM50341727
(3-amino-6-(3-(methylsulfonyl)phenyl)-N-phenylpyraz...)
Show SMILES CS(=O)(=O)c1cccc(c1)-c1cnc(N)c(n1)C(=O)Nc1ccccc1
Show InChI InChI=1S/C18H16N4O3S/c1-26(24,25)14-9-5-6-12(10-14)15-11-20-17(19)16(22-15)18(23)21-13-7-3-2-4-8-13/h2-11H,1H3,(H2,19,20)(H,21,23)
Reactome pathway
n/an/a 340n/an/an/an/an/an/a
Vertex Pharmaceuticals (Europe) Ltd.
Curated by ChEMBL
Assay Description
Inhibition of full length recombinant ATR after 24 hrs by radiometric phosphate incorporation assay
J Med Chem 54: 2320-30 (2011)
Article DOI: 10.1021/jm101488z
BindingDB Entry DOI: 10.7270/Q2WS8TK6
DNA-dependent protein kinase catalytic subunit
(Homo sapiens (Human))
BDBM50341727
(3-amino-6-(3-(methylsulfonyl)phenyl)-N-phenylpyraz...)
Show SMILES CS(=O)(=O)c1cccc(c1)-c1cnc(N)c(n1)C(=O)Nc1ccccc1
Show InChI InChI=1S/C18H16N4O3S/c1-26(24,25)14-9-5-6-12(10-14)15-11-20-17(19)16(22-15)18(23)21-13-7-3-2-4-8-13/h2-11H,1H3,(H2,19,20)(H,21,23)
n/an/a 740n/an/an/an/an/an/a
Vertex Pharmaceuticals (Europe) Ltd.
Curated by ChEMBL
Assay Description
Inhibition of DNAPK after 2 hrs by radiometric phosphate incorporation assay
J Med Chem 54: 2320-30 (2011)
Article DOI: 10.1021/jm101488z
BindingDB Entry DOI: 10.7270/Q2WS8TK6
Serine-protein kinase ATM
(Homo sapiens (Human))
BDBM50341727
(3-amino-6-(3-(methylsulfonyl)phenyl)-N-phenylpyraz...)
Show SMILES CS(=O)(=O)c1cccc(c1)-c1cnc(N)c(n1)C(=O)Nc1ccccc1
Show InChI InChI=1S/C18H16N4O3S/c1-26(24,25)14-9-5-6-12(10-14)15-11-20-17(19)16(22-15)18(23)21-13-7-3-2-4-8-13/h2-11H,1H3,(H2,19,20)(H,21,23)
n/an/a 6.60E+3n/an/an/an/an/an/a
Vertex Pharmaceuticals (Europe) Ltd.
Curated by ChEMBL
Assay Description
Inhibition of full length recombinant ATM after 24 hrs by radiometric phosphate incorporation assay
J Med Chem 54: 2320-30 (2011)
Article DOI: 10.1021/jm101488z
BindingDB Entry DOI: 10.7270/Q2WS8TK6