BDBM50341745 3-amino-6-(4-(methylsulfinyl)phenyl)-N-phenylpyrazine-2-carboxamide::CHEMBL1766791
SMILES: CS(=O)c1ccc(cc1)-c1cnc(N)c(n1)C(=O)Nc1ccccc1
InChI Key: InChIKey=XKSHJVRSLGTDOV-UHFFFAOYSA-N
Data: 4 IC50
Activity Spreadsheet -- Enzyme Inhibition Constant Data from BindingDB
Found 4 hits for monomerid = 50341745
Trg + Lig
Ki
nM
ΔG°
kcal/mole
IC50
nM
Kd
nM
EC50/IC50
nM
koff
s-1
kon
M-1s-1
pHTemp
°C
Serine/threonine-protein kinase ATR
(Homo sapiens (Human))
BDBM50341745
(3-amino-6-(4-(methylsulfinyl)phenyl)-N-phenylpyraz...)
Show SMILES CS(=O)c1ccc(cc1)-c1cnc(N)c(n1)C(=O)Nc1ccccc1
Show InChI InChI=1S/C18H16N4O2S/c1-25(24)14-9-7-12(8-10-14)15-11-20-17(19)16(22-15)18(23)21-13-5-3-2-4-6-13/h2-11H,1H3,(H2,19,20)(H,21,23)
Reactome pathway
n/an/a 56n/an/an/an/an/an/a
Vertex Pharmaceuticals (Europe) Ltd.
Curated by ChEMBL
Assay Description
Inhibition of full length recombinant ATR after 24 hrs by radiometric phosphate incorporation assay
J Med Chem 54: 2320-30 (2011)
Article DOI: 10.1021/jm101488z
BindingDB Entry DOI: 10.7270/Q2WS8TK6
Serine/threonine-protein kinase ATR
(Homo sapiens (Human))
BDBM50341745
(3-amino-6-(4-(methylsulfinyl)phenyl)-N-phenylpyraz...)
Show SMILES CS(=O)c1ccc(cc1)-c1cnc(N)c(n1)C(=O)Nc1ccccc1
Show InChI InChI=1S/C18H16N4O2S/c1-25(24)14-9-7-12(8-10-14)15-11-20-17(19)16(22-15)18(23)21-13-5-3-2-4-6-13/h2-11H,1H3,(H2,19,20)(H,21,23)
Reactome pathway
n/an/a 5.40E+3n/an/an/an/an/an/a
Vertex Pharmaceuticals (Europe) Ltd.
Curated by ChEMBL
Assay Description
Inhibition of ATR in human HT-29 cells assessed as hydroxyurea-induced phosphorylation of H2AX by immunofluorescence microscopy
J Med Chem 54: 2320-30 (2011)
Article DOI: 10.1021/jm101488z
BindingDB Entry DOI: 10.7270/Q2WS8TK6
Serine-protein kinase ATM
(Homo sapiens (Human))
BDBM50341745
(3-amino-6-(4-(methylsulfinyl)phenyl)-N-phenylpyraz...)
Show SMILES CS(=O)c1ccc(cc1)-c1cnc(N)c(n1)C(=O)Nc1ccccc1
Show InChI InChI=1S/C18H16N4O2S/c1-25(24)14-9-7-12(8-10-14)15-11-20-17(19)16(22-15)18(23)21-13-5-3-2-4-6-13/h2-11H,1H3,(H2,19,20)(H,21,23)
n/an/a>8.00E+3n/an/an/an/an/an/a
Vertex Pharmaceuticals (Europe) Ltd.
Curated by ChEMBL
Assay Description
Inhibition of full length recombinant ATM after 24 hrs by radiometric phosphate incorporation assay
J Med Chem 54: 2320-30 (2011)
Article DOI: 10.1021/jm101488z
BindingDB Entry DOI: 10.7270/Q2WS8TK6
DNA-dependent protein kinase catalytic subunit
(Homo sapiens (Human))
BDBM50341745
(3-amino-6-(4-(methylsulfinyl)phenyl)-N-phenylpyraz...)
Show SMILES CS(=O)c1ccc(cc1)-c1cnc(N)c(n1)C(=O)Nc1ccccc1
Show InChI InChI=1S/C18H16N4O2S/c1-25(24)14-9-7-12(8-10-14)15-11-20-17(19)16(22-15)18(23)21-13-5-3-2-4-6-13/h2-11H,1H3,(H2,19,20)(H,21,23)
n/an/a 6.80E+3n/an/an/an/an/an/a
Vertex Pharmaceuticals (Europe) Ltd.
Curated by ChEMBL
Assay Description
Inhibition of DNAPK after 2 hrs by radiometric phosphate incorporation assay
J Med Chem 54: 2320-30 (2011)
Article DOI: 10.1021/jm101488z
BindingDB Entry DOI: 10.7270/Q2WS8TK6