BDBM50341755 3-(1H-benzo[d]imidazol-2-yl)-5-(4-(methylsulfonyl)phenyl)-pyrazin-2-amine::CHEMBL1766801::US10479784, Compound I-123::US10961232, Compound I-123
SMILES: CS(=O)(=O)c1ccc(cc1)-c1cnc(N)c(n1)-c1nc2ccccc2[nH]1
InChI Key: InChIKey=NVZFTEWCKUYXCM-UHFFFAOYSA-N
Data: 2 KI  3 IC50
Activity Spreadsheet -- Enzyme Inhibition Constant Data from BindingDB
Found 5 hits for monomerid = 50341755
Trg + Lig
Ki
nM
ΔG°
kcal/mole
IC50
nM
Kd
nM
EC50/IC50
nM
koff
s-1
kon
M-1s-1
pHTemp
°C
Serine/threonine-protein kinase ATR
(Homo sapiens (Human))
BDBM50341755
(3-(1H-benzo[d]imidazol-2-yl)-5-(4-(methylsulfonyl)...)
Show SMILES CS(=O)(=O)c1ccc(cc1)-c1cnc(N)c(n1)-c1nc2ccccc2[nH]1
Show InChI InChI=1S/C18H15N5O2S/c1-26(24,25)12-8-6-11(7-9-12)15-10-20-17(19)16(21-15)18-22-13-4-2-3-5-14(13)23-18/h2-10H,1H3,(H2,19,20)(H,22,23)
Reactome pathway
US Patent
55n/an/an/an/an/an/an/an/a
VERTEX PHARMACEUTICALS INCORPORATED
US Patent
Assay Description
Compounds were screened for their ability to inhibit ATR kinase using a radioactive-phosphate incorporation assay. Assays were carried out in a mixtu...
US Patent US10479784 (2019)
BindingDB Entry DOI: 10.7270/Q2GF0WVD
Serine/threonine-protein kinase ATR
(Homo sapiens (Human))
BDBM50341755
(3-(1H-benzo[d]imidazol-2-yl)-5-(4-(methylsulfonyl)...)
Show SMILES CS(=O)(=O)c1ccc(cc1)-c1cnc(N)c(n1)-c1nc2ccccc2[nH]1
Show InChI InChI=1S/C18H15N5O2S/c1-26(24,25)12-8-6-11(7-9-12)15-10-20-17(19)16(21-15)18-22-13-4-2-3-5-14(13)23-18/h2-10H,1H3,(H2,19,20)(H,22,23)
Reactome pathway
US Patent
55n/an/an/an/an/an/an/an/a
VERTEX PHARMACEUTICALS INCORPORATED
US Patent
Assay Description
Compounds were screened for their ability to inhibit ATR kinase using a radioactive-phosphate incorporation assay. Assays were carried out in a mixtu...
US Patent US10961232 (2021)
Serine/threonine-protein kinase ATR
(Homo sapiens (Human))
BDBM50341755
(3-(1H-benzo[d]imidazol-2-yl)-5-(4-(methylsulfonyl)...)
Show SMILES CS(=O)(=O)c1ccc(cc1)-c1cnc(N)c(n1)-c1nc2ccccc2[nH]1
Show InChI InChI=1S/C18H15N5O2S/c1-26(24,25)12-8-6-11(7-9-12)15-10-20-17(19)16(21-15)18-22-13-4-2-3-5-14(13)23-18/h2-10H,1H3,(H2,19,20)(H,22,23)
Reactome pathway
n/an/a 30n/an/an/an/an/an/a
Vertex Pharmaceuticals (Europe) Ltd.
Curated by ChEMBL
Assay Description
Inhibition of full length recombinant ATR after 24 hrs by radiometric phosphate incorporation assay
J Med Chem 54: 2320-30 (2011)
Article DOI: 10.1021/jm101488z
BindingDB Entry DOI: 10.7270/Q2WS8TK6
DNA-dependent protein kinase catalytic subunit
(Homo sapiens (Human))
BDBM50341755
(3-(1H-benzo[d]imidazol-2-yl)-5-(4-(methylsulfonyl)...)
Show SMILES CS(=O)(=O)c1ccc(cc1)-c1cnc(N)c(n1)-c1nc2ccccc2[nH]1
Show InChI InChI=1S/C18H15N5O2S/c1-26(24,25)12-8-6-11(7-9-12)15-10-20-17(19)16(21-15)18-22-13-4-2-3-5-14(13)23-18/h2-10H,1H3,(H2,19,20)(H,22,23)
n/an/a 2.10E+3n/an/an/an/an/an/a
Vertex Pharmaceuticals (Europe) Ltd.
Curated by ChEMBL
Assay Description
Inhibition of DNAPK after 2 hrs by radiometric phosphate incorporation assay
J Med Chem 54: 2320-30 (2011)
Article DOI: 10.1021/jm101488z
BindingDB Entry DOI: 10.7270/Q2WS8TK6
Serine-protein kinase ATM
(Homo sapiens (Human))
BDBM50341755
(3-(1H-benzo[d]imidazol-2-yl)-5-(4-(methylsulfonyl)...)
Show SMILES CS(=O)(=O)c1ccc(cc1)-c1cnc(N)c(n1)-c1nc2ccccc2[nH]1
Show InChI InChI=1S/C18H15N5O2S/c1-26(24,25)12-8-6-11(7-9-12)15-10-20-17(19)16(21-15)18-22-13-4-2-3-5-14(13)23-18/h2-10H,1H3,(H2,19,20)(H,22,23)
n/an/a 380n/an/an/an/an/an/a
Vertex Pharmaceuticals (Europe) Ltd.
Curated by ChEMBL
Assay Description
Inhibition of full length recombinant ATM after 24 hrs by radiometric phosphate incorporation assay
J Med Chem 54: 2320-30 (2011)
Article DOI: 10.1021/jm101488z
BindingDB Entry DOI: 10.7270/Q2WS8TK6