BDBM50341771 4-{5-[(2-Phenyl-5-trifluoromethyloxazole-4-carbonyl)amino]-pyrimidin-2-yl}piperazine-1-carboxylic Acid Methyl Ester::CHEMBL1766889
SMILES: COC(=O)N1CCN(CC1)c1ncc(NC(=O)c2nc(oc2C(F)(F)F)-c2ccccc2)cn1
InChI Key: InChIKey=DLCZOOQVYHOLGV-UHFFFAOYSA-N
Data: 1 IC50  1 EC50
Activity Spreadsheet -- Enzyme Inhibition Constant Data from BindingDB
Found 2 hits for monomerid = 50341771
Trg + Lig
Ki
nM
ΔG°
kcal/mole
IC50
nM
Kd
nM
EC50/IC50
nM
koff
s-1
kon
M-1s-1
pHTemp
°C
Diacylglycerol O-acyltransferase 1 (DGAT1)
(Homo sapiens (Human))
BDBM50341771
(4-{5-[(2-Phenyl-5-trifluoromethyloxazole-4-carbony...)
Show SMILES COC(=O)N1CCN(CC1)c1ncc(NC(=O)c2nc(oc2C(F)(F)F)-c2ccccc2)cn1
Show InChI InChI=1S/C21H19F3N6O4/c1-33-20(32)30-9-7-29(8-10-30)19-25-11-14(12-26-19)27-17(31)15-16(21(22,23)24)34-18(28-15)13-5-3-2-4-6-13/h2-6,11-12H,7-10H2,1H3,(H,27,31)
n/an/a 71n/an/an/an/an/an/a
Hoffmann-La Roche Inc.
Curated by ChEMBL
Assay Description
Inhibition of human DGAT1 expressed in baculovirus infected insect cells after 1 hr using palmitoyl-1-14C-coenzyme A by phospholipid flashplate assay
J Med Chem 54: 2433-46 (2011)
Article DOI: 10.1021/jm101580m
BindingDB Entry DOI: 10.7270/Q2S182TQ
Diacylglycerol O-acyltransferase 1 (DGAT1)
(Homo sapiens (Human))
BDBM50341771
(4-{5-[(2-Phenyl-5-trifluoromethyloxazole-4-carbony...)
Show SMILES COC(=O)N1CCN(CC1)c1ncc(NC(=O)c2nc(oc2C(F)(F)F)-c2ccccc2)cn1
Show InChI InChI=1S/C21H19F3N6O4/c1-33-20(32)30-9-7-29(8-10-30)19-25-11-14(12-26-19)27-17(31)15-16(21(22,23)24)34-18(28-15)13-5-3-2-4-6-13/h2-6,11-12H,7-10H2,1H3,(H,27,31)
n/an/an/an/a 410n/an/an/an/a
Hoffmann-La Roche Inc.
Curated by ChEMBL
Assay Description
Inhibition of human DGAT1 expressed in CHO-K1 cells after 1 hr using palmitoyl-1-14C-coenzyme A by phospholipid flashplate assay
J Med Chem 54: 2433-46 (2011)
Article DOI: 10.1021/jm101580m
BindingDB Entry DOI: 10.7270/Q2S182TQ