null
SMILES: O[C@@]1(CCN([C@H]2CCCC[C@H]12)C(=O)c1cc(n[nH]1)-c1ccccc1F)c1ccccc1
InChI Key: InChIKey=CDGLHYPUOWFNMC-QXWFJRNPSA-N
Activity Spreadsheet -- Enzyme Inhibition Constant Data from BindingDB
Found 2 hits for monomerid = 50341925
Trg + Lig
Ki
nM
ΔG°
kcal/mole
IC50
nM
Kd
nM
EC50/IC50
nM
koff
s-1
kon
M-1s-1
pHTemp
°C
Cannabinoid receptor 2
(Homo sapiens (Human))
BDBM50341925
(CHEMBL1765157 | trans-(5-(2-fluorophenyl)-1H-pyraz...)
Show SMILES O[C@@]1(CCN([C@H]2CCCC[C@H]12)C(=O)c1cc(n[nH]1)-c1ccccc1F)c1ccccc1 |r|
Show InChI InChI=1S/C25H26FN3O2/c26-20-12-6-4-10-18(20)21-16-22(28-27-21)24(30)29-15-14-25(31,17-8-2-1-3-9-17)19-11-5-7-13-23(19)29/h1-4,6,8-10,12,16,19,23,31H,5,7,11,13-15H2,(H,27,28)/t19-,23-,25-/m0/s1
Reactome pathway
n/an/a 1.29E+3n/an/an/an/an/an/a
Merck Research Laboratories
Curated by ChEMBL
Assay Description
Agonist activity at human CB2 receptor expressed in CHOK1 cells assessed as inhibition of forskolin-induced cAMP production treated 15 mins before fo...
Bioorg Med Chem Lett 21: 2359-64 (2011)
Article DOI: 10.1016/j.bmcl.2011.02.078
BindingDB Entry DOI: 10.7270/Q2M90901
Cannabinoid receptor 1
(Homo sapiens (Human))
BDBM50341925
(CHEMBL1765157 | trans-(5-(2-fluorophenyl)-1H-pyraz...)
Show SMILES O[C@@]1(CCN([C@H]2CCCC[C@H]12)C(=O)c1cc(n[nH]1)-c1ccccc1F)c1ccccc1 |r|
Show InChI InChI=1S/C25H26FN3O2/c26-20-12-6-4-10-18(20)21-16-22(28-27-21)24(30)29-15-14-25(31,17-8-2-1-3-9-17)19-11-5-7-13-23(19)29/h1-4,6,8-10,12,16,19,23,31H,5,7,11,13-15H2,(H,27,28)/t19-,23-,25-/m0/s1
NCI pathway
Reactome pathway
n/an/a>1.70E+4n/an/an/an/an/an/a
Merck Research Laboratories
Curated by ChEMBL
Assay Description
Agonist activity at human CB1 receptor expressed in CHOK1 cells assessed as inhibition of forskolin-induced cAMP production treated 15 mins before fo...
Bioorg Med Chem Lett 21: 2359-64 (2011)
Article DOI: 10.1016/j.bmcl.2011.02.078
BindingDB Entry DOI: 10.7270/Q2M90901