null
SMILES: CN1CCC(CC1)C(=O)N1CC[C@](O)([C@@H]2CCCC[C@H]12)c1ccccc1
InChI Key: InChIKey=BDKPJSNASAZMCK-RZUBCFFCSA-N
Activity Spreadsheet -- Enzyme Inhibition Constant Data from BindingDB
Found 2 hits for monomerid = 50341949
Trg + Lig
Ki
nM
ΔG°
kcal/mole
IC50
nM
Kd
nM
EC50/IC50
nM
koff
s-1
kon
M-1s-1
pHTemp
°C
Cannabinoid receptor 2
(Homo sapiens (Human))
BDBM50341949
(CHEMBL1765274 | cis-rac-((4S,4aR,8aS)-4-hydroxy-4-...)
Show SMILES CN1CCC(CC1)C(=O)N1CC[C@](O)([C@@H]2CCCC[C@H]12)c1ccccc1 |r|
Show InChI InChI=1S/C22H32N2O2/c1-23-14-11-17(12-15-23)21(25)24-16-13-22(26,18-7-3-2-4-8-18)19-9-5-6-10-20(19)24/h2-4,7-8,17,19-20,26H,5-6,9-16H2,1H3/t19-,20+,22-/m1/s1
Reactome pathway
n/an/a 395n/an/an/an/an/an/a
Merck Research Laboratories
Curated by ChEMBL
Assay Description
Agonist activity at human CB2 receptor expressed in CHOK1 cells assessed as inhibition of forskolin-induced cAMP production treated 15 mins before fo...
Bioorg Med Chem Lett 21: 2359-64 (2011)
Article DOI: 10.1016/j.bmcl.2011.02.078
BindingDB Entry DOI: 10.7270/Q2M90901
Cannabinoid receptor 1
(Homo sapiens (Human))
BDBM50341949
(CHEMBL1765274 | cis-rac-((4S,4aR,8aS)-4-hydroxy-4-...)
Show SMILES CN1CCC(CC1)C(=O)N1CC[C@](O)([C@@H]2CCCC[C@H]12)c1ccccc1 |r|
Show InChI InChI=1S/C22H32N2O2/c1-23-14-11-17(12-15-23)21(25)24-16-13-22(26,18-7-3-2-4-8-18)19-9-5-6-10-20(19)24/h2-4,7-8,17,19-20,26H,5-6,9-16H2,1H3/t19-,20+,22-/m1/s1
NCI pathway
Reactome pathway
n/an/a>1.70E+4n/an/an/an/an/an/a
Merck Research Laboratories
Curated by ChEMBL
Assay Description
Agonist activity at human CB1 receptor expressed in CHOK1 cells assessed as inhibition of forskolin-induced cAMP production treated 15 mins before fo...
Bioorg Med Chem Lett 21: 2359-64 (2011)
Article DOI: 10.1016/j.bmcl.2011.02.078
BindingDB Entry DOI: 10.7270/Q2M90901