null
SMILES: O[C@]1(CCN([C@H]2CCCC[C@@H]12)C(=O)C1CCC(=O)N1)c1ccccc1
InChI Key: InChIKey=UBGHTIXJJGYNFD-MQWDNKACSA-N
Activity Spreadsheet -- Enzyme Inhibition Constant Data from BindingDB
Found 2 hits for monomerid = 50341961
Trg + Lig
Ki
nM
ΔG°
kcal/mole
IC50
nM
Kd
nM
EC50/IC50
nM
koff
s-1
kon
M-1s-1
pHTemp
°C
Cannabinoid receptor 2
(Homo sapiens (Human))
BDBM50341961
(CHEMBL1765287 | cis-rac-5-((4S,4aR,8aS)-4-hydroxy-...)
Show SMILES O[C@]1(CCN([C@H]2CCCC[C@@H]12)C(=O)C1CCC(=O)N1)c1ccccc1 |r|
Show InChI InChI=1S/C20H26N2O3/c23-18-11-10-16(21-18)19(24)22-13-12-20(25,14-6-2-1-3-7-14)15-8-4-5-9-17(15)22/h1-3,6-7,15-17,25H,4-5,8-13H2,(H,21,23)/t15-,16?,17+,20-/m1/s1
Reactome pathway
n/an/a 193n/an/an/an/an/an/a
Merck Research Laboratories
Curated by ChEMBL
Assay Description
Agonist activity at human CB2 receptor expressed in CHOK1 cells assessed as inhibition of forskolin-induced cAMP production treated 15 mins before fo...
Bioorg Med Chem Lett 21: 2359-64 (2011)
Article DOI: 10.1016/j.bmcl.2011.02.078
BindingDB Entry DOI: 10.7270/Q2M90901
Cannabinoid receptor 1
(Homo sapiens (Human))
BDBM50341961
(CHEMBL1765287 | cis-rac-5-((4S,4aR,8aS)-4-hydroxy-...)
Show SMILES O[C@]1(CCN([C@H]2CCCC[C@@H]12)C(=O)C1CCC(=O)N1)c1ccccc1 |r|
Show InChI InChI=1S/C20H26N2O3/c23-18-11-10-16(21-18)19(24)22-13-12-20(25,14-6-2-1-3-7-14)15-8-4-5-9-17(15)22/h1-3,6-7,15-17,25H,4-5,8-13H2,(H,21,23)/t15-,16?,17+,20-/m1/s1
NCI pathway
Reactome pathway
n/an/a>1.70E+4n/an/an/an/an/an/a
Merck Research Laboratories
Curated by ChEMBL
Assay Description
Agonist activity at human CB1 receptor expressed in CHOK1 cells assessed as inhibition of forskolin-induced cAMP production treated 15 mins before fo...
Bioorg Med Chem Lett 21: 2359-64 (2011)
Article DOI: 10.1016/j.bmcl.2011.02.078
BindingDB Entry DOI: 10.7270/Q2M90901