BDBM50342527 (S)-2-(2-amino-3-(3-(5-hydroxypyridin-2-yl)-1,2,4-oxadiazol-5-yl)propanamido)cyclohex-1-enecarboxylic acid::CHEMBL1770355
SMILES: N[C@@H](Cc1nc(no1)-c1ccc(O)cn1)C(=O)NC1=C(CCCC1)C(O)=O
InChI Key: InChIKey=BHNQCBPLZXKWKH-NSHDSACASA-N
Data: 1 IC50  1 EC50
Activity Spreadsheet -- Enzyme Inhibition Constant Data from BindingDB
Found 2 hits for monomerid = 50342527
Trg + Lig
Ki
nM
ΔG°
kcal/mole
IC50
nM
Kd
nM
EC50/IC50
nM
koff
s-1
kon
M-1s-1
pHTemp
°C
Hydroxycarboxylic acid receptor 2
(Homo sapiens (Human))
BDBM50342527
((S)-2-(2-amino-3-(3-(5-hydroxypyridin-2-yl)-1,2,4-...)
Show SMILES N[C@@H](Cc1nc(no1)-c1ccc(O)cn1)C(=O)NC1=C(CCCC1)C(O)=O |r,t:20|
Show InChI InChI=1S/C17H19N5O5/c18-11(16(24)20-12-4-2-1-3-10(12)17(25)26)7-14-21-15(22-27-14)13-6-5-9(23)8-19-13/h5-6,8,11,23H,1-4,7,18H2,(H,20,24)(H,25,26)/t11-/m0/s1
Reactome pathway
n/an/an/an/a 39n/an/an/an/a
Merck Research Laboratories
Curated by ChEMBL
Assay Description
Agonist activity at human recombinant GPR109A receptor expressed in CHO-K1 cells after 60 mins by [35S]GTPgammaS binding assay
Bioorg Med Chem Lett 21: 2721-4 (2011)
Article DOI: 10.1016/j.bmcl.2010.11.116
BindingDB Entry DOI: 10.7270/Q2N29X8C
Hydroxycarboxylic acid receptor 2
(Homo sapiens (Human))
BDBM50342527
((S)-2-(2-amino-3-(3-(5-hydroxypyridin-2-yl)-1,2,4-...)
Show SMILES N[C@@H](Cc1nc(no1)-c1ccc(O)cn1)C(=O)NC1=C(CCCC1)C(O)=O |r,t:20|
Show InChI InChI=1S/C17H19N5O5/c18-11(16(24)20-12-4-2-1-3-10(12)17(25)26)7-14-21-15(22-27-14)13-6-5-9(23)8-19-13/h5-6,8,11,23H,1-4,7,18H2,(H,20,24)(H,25,26)/t11-/m0/s1
Reactome pathway
n/an/a 5n/an/an/an/an/an/a
Merck Research Laboratories
Curated by ChEMBL
Assay Description
Displacement of [3H]nicotinic acid from human GPR109A receptor
Bioorg Med Chem Lett 21: 2721-4 (2011)
Article DOI: 10.1016/j.bmcl.2010.11.116
BindingDB Entry DOI: 10.7270/Q2N29X8C