BDBM50342539 2-(3-chlorobenzyl)-6,7,8,9-tetrahydro-5H-pyrimido[5,4-d]azepine::CHEMBL1770382
SMILES: Clc1cccc(Cc2ncc3CCNCCc3n2)c1
InChI Key: InChIKey=QBQLRABAJGBGHY-UHFFFAOYSA-N
Data: 1 KI  2 EC50
Activity Spreadsheet -- Enzyme Inhibition Constant Data from BindingDB
Found 3 hits for monomerid = 50342539
Trg + Lig
Ki
nM
ΔG°
kcal/mole
IC50
nM
Kd
nM
EC50/IC50
nM
koff
s-1
kon
M-1s-1
pHTemp
°C
5-hydroxytryptamine receptor 2C
(Homo sapiens (Human))
BDBM50342539
(2-(3-chlorobenzyl)-6,7,8,9-tetrahydro-5H-pyrimido[...)
Show SMILES Clc1cccc(Cc2ncc3CCNCCc3n2)c1
Show InChI InChI=1S/C15H16ClN3/c16-13-3-1-2-11(8-13)9-15-18-10-12-4-6-17-7-5-14(12)19-15/h1-3,8,10,17H,4-7,9H2
Reactome pathway
84n/an/an/an/an/an/an/an/a
Pfizer Inc.
Curated by ChEMBL
Assay Description
Displacement of [3H]meselurgine from human 5HT2C receptor expressed in Swiss mouse 3T3 cells by scintillation proximity assay
Bioorg Med Chem Lett 21: 2715-20 (2011)
Article DOI: 10.1016/j.bmcl.2010.11.120
BindingDB Entry DOI: 10.7270/Q2HD7VZZ
5-hydroxytryptamine receptor 2C
(Homo sapiens (Human))
BDBM50342539
(2-(3-chlorobenzyl)-6,7,8,9-tetrahydro-5H-pyrimido[...)
Show SMILES Clc1cccc(Cc2ncc3CCNCCc3n2)c1
Show InChI InChI=1S/C15H16ClN3/c16-13-3-1-2-11(8-13)9-15-18-10-12-4-6-17-7-5-14(12)19-15/h1-3,8,10,17H,4-7,9H2
Reactome pathway
n/an/an/an/a 180n/an/an/an/a
Pfizer Inc.
Curated by ChEMBL
Assay Description
Agonist activity at human 5HT2C receptor expressed in CHO-K1 cells assessed as increase of fluorescence based calcium mobilization by FLIPR assay
Bioorg Med Chem Lett 21: 2715-20 (2011)
Article DOI: 10.1016/j.bmcl.2010.11.120
BindingDB Entry DOI: 10.7270/Q2HD7VZZ
5-hydroxytryptamine receptor 2B
(Homo sapiens (Human))
BDBM50342539
(2-(3-chlorobenzyl)-6,7,8,9-tetrahydro-5H-pyrimido[...)
Show SMILES Clc1cccc(Cc2ncc3CCNCCc3n2)c1
Show InChI InChI=1S/C15H16ClN3/c16-13-3-1-2-11(8-13)9-15-18-10-12-4-6-17-7-5-14(12)19-15/h1-3,8,10,17H,4-7,9H2
Reactome pathway
n/an/an/an/a 30n/an/an/an/a
Pfizer Inc.
Curated by ChEMBL
Assay Description
Agonist activity at human 5HT2B receptor expressed in CHO-K1 cells assessed as increase of fluorescence based calcium mobilization by FLIPR assay
Bioorg Med Chem Lett 21: 2715-20 (2011)
Article DOI: 10.1016/j.bmcl.2010.11.120
BindingDB Entry DOI: 10.7270/Q2HD7VZZ