BDBM50342744 CHEMBL1771292::phenyl-sulfonamido-farnesylcysteine
SMILES: [#6]\[#6](-[#6])=[#6]\[#6]-[#6]\[#6](-[#6])=[#6]\[#6]-[#6]\[#6](-[#6])=[#6]\[#6]-[#16]-[#6]-[#6@H](-[#7]S(=O)(=O)c1ccccc1)-[#6](-[#8])=O
InChI Key: InChIKey=ZTPQEXIBYYNKBX-UBXMOETMSA-N
Data: 1 IC50
Activity Spreadsheet -- Enzyme Inhibition Constant Data from BindingDB
Found 1 hit for monomerid = 50342744
Trg + Lig
Ki
nM
ΔG°
kcal/mole
IC50
nM
Kd
nM
EC50/IC50
nM
koff
s-1
kon
M-1s-1
pHTemp
°C
Protein-S-isoprenylcysteine O-methyltransferase
(Homo sapiens (Human))
BDBM50342744
(CHEMBL1771292 | phenyl-sulfonamido-farnesylcystein...)
Show SMILES [#6]\[#6](-[#6])=[#6]\[#6]-[#6]\[#6](-[#6])=[#6]\[#6]-[#6]\[#6](-[#6])=[#6]\[#6]-[#16]-[#6]-[#6@H](-[#7]S(=O)(=O)c1ccccc1)-[#6](-[#8])=O |r|
Show InChI InChI=1S/C24H35NO4S2/c1-19(2)10-8-11-20(3)12-9-13-21(4)16-17-30-18-23(24(26)27)25-31(28,29)22-14-6-5-7-15-22/h5-7,10,12,14-16,23,25H,8-9,11,13,17-18H2,1-4H3,(H,26,27)/b20-12+,21-16+/t23-/m0/s1
n/an/a 1.70E+4n/an/an/an/an/an/a
Purdue University
Curated by ChEMBL
Assay Description
Inhibition of human ICMT incubated with N-Acetyl-S-farnesyl-L-cysteine substrate for 5 mins followed by addition of [14C]-SAM measured after 30 mins ...
Bioorg Med Chem Lett 21: 2616-20 (2011)
Article DOI: 10.1016/j.bmcl.2011.01.078
BindingDB Entry DOI: 10.7270/Q2348KNH