null
SMILES: [#6]-[#7](-[#6])-c1cccc2c(cccc12)S(=O)(=O)[#7]-[#6@@H](-[#6]-[#16]-[#6]\[#6]=[#6](/[#6])-[#6]-[#6]\[#6]=[#6](/[#6])-[#6]-[#6]\[#6]=[#6](\[#6])-[#6])-[#6](-[#8])=O
InChI Key: InChIKey=QYNYSIOWDVIGEA-DRBKCPGESA-N
Activity Spreadsheet -- Enzyme Inhibition Constant Data from BindingDB
Found 1 hit for monomerid = 50342745
Trg + Lig
Ki
nM
ΔG°
kcal/mole
IC50
nM
Kd
nM
EC50/IC50
nM
koff
s-1
kon
M-1s-1
pHTemp
°C
Protein-S-isoprenylcysteine O-methyltransferase
(Homo sapiens (Human))
BDBM50342745
((R)-2-(5-(dimethylamino)naphthalene-1-sulfonamido)...)
Show SMILES [#6]-[#7](-[#6])-c1cccc2c(cccc12)S(=O)(=O)[#7]-[#6@@H](-[#6]-[#16]-[#6]\[#6]=[#6](/[#6])-[#6]-[#6]\[#6]=[#6](/[#6])-[#6]-[#6]\[#6]=[#6](\[#6])-[#6])-[#6](-[#8])=O |r|
Show InChI InChI=1S/C30H42N2O4S2/c1-22(2)11-7-12-23(3)13-8-14-24(4)19-20-37-21-27(30(33)34)31-38(35,36)29-18-10-15-25-26(29)16-9-17-28(25)32(5)6/h9-11,13,15-19,27,31H,7-8,12,14,20-21H2,1-6H3,(H,33,34)/b23-13+,24-19+/t27-/m0/s1
n/an/a 1.16E+4n/an/an/an/an/an/a
Purdue University
Curated by ChEMBL
Assay Description
Inhibition of human ICMT incubated with N-Acetyl-S-farnesyl-L-cysteine substrate for 5 mins followed by addition of [14C]-SAM measured after 30 mins ...
Bioorg Med Chem Lett 21: 2616-20 (2011)
Article DOI: 10.1016/j.bmcl.2011.01.078
BindingDB Entry DOI: 10.7270/Q2348KNH