null
SMILES: [#6]\[#6](-[#6])=[#6]\[#6]-[#6]\[#6](-[#6])=[#6]\[#6]-[#6]\[#6](-[#6])=[#6]\[#6]-[#16]-[#6]-[#6@H](-[#7]S(=O)(=O)c1ccc(F)cc1)-[#6](-[#8])=O
InChI Key: InChIKey=OKZBZKXNLZITBV-ZRMCUCBQSA-N
Activity Spreadsheet -- Enzyme Inhibition Constant Data from BindingDB
Found 1 hit for monomerid = 50342748
Trg + Lig
Ki
nM
ΔG°
kcal/mole
IC50
nM
Kd
nM
EC50/IC50
nM
koff
s-1
kon
M-1s-1
pHTemp
°C
Protein-S-isoprenylcysteine O-methyltransferase
(Homo sapiens (Human))
BDBM50342748
(4-fluoro-phenyl-sulfonamido-farnesylcysteine | CHE...)
Show SMILES [#6]\[#6](-[#6])=[#6]\[#6]-[#6]\[#6](-[#6])=[#6]\[#6]-[#6]\[#6](-[#6])=[#6]\[#6]-[#16]-[#6]-[#6@H](-[#7]S(=O)(=O)c1ccc(F)cc1)-[#6](-[#8])=O |r|
Show InChI InChI=1S/C24H34FNO4S2/c1-18(2)7-5-8-19(3)9-6-10-20(4)15-16-31-17-23(24(27)28)26-32(29,30)22-13-11-21(25)12-14-22/h7,9,11-15,23,26H,5-6,8,10,16-17H2,1-4H3,(H,27,28)/b19-9+,20-15+/t23-/m0/s1
n/an/a 1.55E+4n/an/an/an/an/an/a
Purdue University
Curated by ChEMBL
Assay Description
Inhibition of human ICMT incubated with N-Acetyl-S-farnesyl-L-cysteine substrate for 5 mins followed by addition of [14C]-SAM measured after 30 mins ...
Bioorg Med Chem Lett 21: 2616-20 (2011)
Article DOI: 10.1016/j.bmcl.2011.01.078
BindingDB Entry DOI: 10.7270/Q2348KNH