BDBM50342775 CHEMBL457992::N-(2-(7-(N-methylsulfamoyl)naphthalen-1-yl)ethyl)furan-2-carboxamide::N-[2-(7-methylsulfamoyl-naphth-1-yl)ethyl]furan-2-ylcarboxamide
SMILES: CNS(=O)(=O)c1ccc2cccc(CCNC(=O)c3ccco3)c2c1
InChI Key: InChIKey=ZMQJWTSYMGTHFB-UHFFFAOYSA-N
Data: 4 IC50
Activity Spreadsheet -- Enzyme Inhibition Constant Data from BindingDB
Found 4 hits for monomerid = 50342775
Trg + Lig
Ki
nM
ΔG°
kcal/mole
IC50
nM
Kd
nM
EC50/IC50
nM
koff
s-1
kon
M-1s-1
pHTemp
°C
Melatonin receptor
(Homo sapiens (Human))
BDBM50342775
(CHEMBL457992 | N-(2-(7-(N-methylsulfamoyl)naphthal...)
Show SMILES CNS(=O)(=O)c1ccc2cccc(CCNC(=O)c3ccco3)c2c1
Show InChI InChI=1S/C18H18N2O4S/c1-19-25(22,23)15-8-7-13-4-2-5-14(16(13)12-15)9-10-20-18(21)17-6-3-11-24-17/h2-8,11-12,19H,9-10H2,1H3,(H,20,21)
Reactome pathway
n/an/a 2.61E+3n/an/an/an/an/an/a
Univ Lille Nord de France
Curated by ChEMBL
Assay Description
Binding affinity to human MT1 receptor
Eur J Med Chem 46: 1622-9 (2011)
Article DOI: 10.1016/j.ejmech.2011.02.010
BindingDB Entry DOI: 10.7270/Q2PZ594W
Ribosyldihydronicotinamide dehydrogenase [quinone]
(Homo sapiens (Human))
BDBM50342775
(CHEMBL457992 | N-(2-(7-(N-methylsulfamoyl)naphthal...)
Show SMILES CNS(=O)(=O)c1ccc2cccc(CCNC(=O)c3ccco3)c2c1
Show InChI InChI=1S/C18H18N2O4S/c1-19-25(22,23)15-8-7-13-4-2-5-14(16(13)12-15)9-10-20-18(21)17-6-3-11-24-17/h2-8,11-12,19H,9-10H2,1H3,(H,20,21)
n/an/a 9.12n/an/an/an/an/an/a
Lanzhou University
Curated by ChEMBL
Assay Description
Displacement of [125I]iodomelatonin from MT3/QR2 melatonin binding site expressed in CHO cells
Eur J Med Chem 43: 2861-9 (2008)
Article DOI: 10.1016/j.ejmech.2008.02.012
BindingDB Entry DOI: 10.7270/Q21C1Z31
Ribosyldihydronicotinamide dehydrogenase [quinone]
(Homo sapiens (Human))
BDBM50342775
(CHEMBL457992 | N-(2-(7-(N-methylsulfamoyl)naphthal...)
Show SMILES CNS(=O)(=O)c1ccc2cccc(CCNC(=O)c3ccco3)c2c1
Show InChI InChI=1S/C18H18N2O4S/c1-19-25(22,23)15-8-7-13-4-2-5-14(16(13)12-15)9-10-20-18(21)17-6-3-11-24-17/h2-8,11-12,19H,9-10H2,1H3,(H,20,21)
n/an/a 9.10n/an/an/an/an/an/a
Univ Lille Nord de France
Curated by ChEMBL
Assay Description
Binding affinity to human MT3 receptor
Eur J Med Chem 46: 1622-9 (2011)
Article DOI: 10.1016/j.ejmech.2011.02.010
BindingDB Entry DOI: 10.7270/Q2PZ594W
Melatonin receptor
(Homo sapiens (Human))
BDBM50342775
(CHEMBL457992 | N-(2-(7-(N-methylsulfamoyl)naphthal...)
Show SMILES CNS(=O)(=O)c1ccc2cccc(CCNC(=O)c3ccco3)c2c1
Show InChI InChI=1S/C18H18N2O4S/c1-19-25(22,23)15-8-7-13-4-2-5-14(16(13)12-15)9-10-20-18(21)17-6-3-11-24-17/h2-8,11-12,19H,9-10H2,1H3,(H,20,21)
Reactome pathway
n/an/a 6.84E+3n/an/an/an/an/an/a
Univ Lille Nord de France
Curated by ChEMBL
Assay Description
Binding affinity to human MT2 receptor
Eur J Med Chem 46: 1622-9 (2011)
Article DOI: 10.1016/j.ejmech.2011.02.010
BindingDB Entry DOI: 10.7270/Q2PZ594W