BDBM50342919 6-(benzo[d][1,3]dioxol-5-yl)-N-methyl-N-((4-methylthiazol-2-yl)methyl)quinazolin-4-amine::CHEMBL1704879
SMILES: CN(Cc1nc(C)cs1)c1ncnc2ccc(cc12)-c1ccc2OCOc2c1
InChI Key: InChIKey=BYMPGMQLSBLSIU-UHFFFAOYSA-N
Data: 6 IC50
Activity Spreadsheet -- Enzyme Inhibition Constant Data from BindingDB
Found 6 hits for monomerid = 50342919
Trg + Lig
Ki
nM
ΔG°
kcal/mole
IC50
nM
Kd
nM
EC50/IC50
nM
koff
s-1
kon
M-1s-1
pHTemp
°C
CDC2-like kinase 3 (CLK3)
(Homo sapiens (Human))
BDBM50342919
(6-(benzo[d][1,3]dioxol-5-yl)-N-methyl-N-((4-methyl...)
Show SMILES CN(Cc1nc(C)cs1)c1ncnc2ccc(cc12)-c1ccc2OCOc2c1
Show InChI InChI=1S/C21H18N4O2S/c1-13-10-28-20(24-13)9-25(2)21-16-7-14(3-5-17(16)22-11-23-21)15-4-6-18-19(8-15)27-12-26-18/h3-8,10-11H,9,12H2,1-2H3
n/an/a 3.02E+3n/an/an/an/an/an/a
National Human Genome Research Institute
Curated by ChEMBL
Assay Description
Inhibition of Clk3 kinase using ATP as substrate by 33P radiolabelled kinase assay
Bioorg Med Chem Lett 21: 3152-8 (2011)
Article DOI: 10.1016/j.bmcl.2011.02.114
BindingDB Entry DOI: 10.7270/Q2J67H83
Dual-specificity tyrosine-phosphorylation regulated kinase 1A
(Homo sapiens (Human))
BDBM50342919
(6-(benzo[d][1,3]dioxol-5-yl)-N-methyl-N-((4-methyl...)
Show SMILES CN(Cc1nc(C)cs1)c1ncnc2ccc(cc12)-c1ccc2OCOc2c1
Show InChI InChI=1S/C21H18N4O2S/c1-13-10-28-20(24-13)9-25(2)21-16-7-14(3-5-17(16)22-11-23-21)15-4-6-18-19(8-15)27-12-26-18/h3-8,10-11H,9,12H2,1-2H3
Reactome pathway
n/an/a 26n/an/an/an/an/an/a
National Human Genome Research Institute
Curated by ChEMBL
Assay Description
Inhibition of Dyrk1A kinase using ATP as substrate by 33P radiolabelled kinase assay
Bioorg Med Chem Lett 21: 3152-8 (2011)
Article DOI: 10.1016/j.bmcl.2011.02.114
BindingDB Entry DOI: 10.7270/Q2J67H83
Dual specificity protein kinase CLK2
(Homo sapiens (Human))
BDBM50342919
(6-(benzo[d][1,3]dioxol-5-yl)-N-methyl-N-((4-methyl...)
Show SMILES CN(Cc1nc(C)cs1)c1ncnc2ccc(cc12)-c1ccc2OCOc2c1
Show InChI InChI=1S/C21H18N4O2S/c1-13-10-28-20(24-13)9-25(2)21-16-7-14(3-5-17(16)22-11-23-21)15-4-6-18-19(8-15)27-12-26-18/h3-8,10-11H,9,12H2,1-2H3
n/an/a 195n/an/an/an/an/an/a
National Human Genome Research Institute
Curated by ChEMBL
Assay Description
Inhibition of Clk2 kinase using ATP as substrate by 33P radiolabelled kinase assay
Bioorg Med Chem Lett 21: 3152-8 (2011)
Article DOI: 10.1016/j.bmcl.2011.02.114
BindingDB Entry DOI: 10.7270/Q2J67H83
Dual-specificity tyrosine-regulated kinases 1B
(Homo sapiens (Human))
BDBM50342919
(6-(benzo[d][1,3]dioxol-5-yl)-N-methyl-N-((4-methyl...)
Show SMILES CN(Cc1nc(C)cs1)c1ncnc2ccc(cc12)-c1ccc2OCOc2c1
Show InChI InChI=1S/C21H18N4O2S/c1-13-10-28-20(24-13)9-25(2)21-16-7-14(3-5-17(16)22-11-23-21)15-4-6-18-19(8-15)27-12-26-18/h3-8,10-11H,9,12H2,1-2H3
n/an/a 48n/an/an/an/an/an/a
National Human Genome Research Institute
Curated by ChEMBL
Assay Description
Inhibition of Dyrk1B kinase using ATP as substrate by 33P radiolabelled kinase assay
Bioorg Med Chem Lett 21: 3152-8 (2011)
Article DOI: 10.1016/j.bmcl.2011.02.114
BindingDB Entry DOI: 10.7270/Q2J67H83
Dual specificty protein kinase CLK1
(Homo sapiens (Human))
BDBM50342919
(6-(benzo[d][1,3]dioxol-5-yl)-N-methyl-N-((4-methyl...)
Show SMILES CN(Cc1nc(C)cs1)c1ncnc2ccc(cc12)-c1ccc2OCOc2c1
Show InChI InChI=1S/C21H18N4O2S/c1-13-10-28-20(24-13)9-25(2)21-16-7-14(3-5-17(16)22-11-23-21)15-4-6-18-19(8-15)27-12-26-18/h3-8,10-11H,9,12H2,1-2H3
n/an/a 128n/an/an/an/an/an/a
National Human Genome Research Institute
Curated by ChEMBL
Assay Description
Inhibition of Clk1 kinase using ATP as substrate by 33P radiolabelled kinase assay
Bioorg Med Chem Lett 21: 3152-8 (2011)
Article DOI: 10.1016/j.bmcl.2011.02.114
BindingDB Entry DOI: 10.7270/Q2J67H83
Dual specificity protein kinase CLK4
(Homo sapiens (Human))
BDBM50342919
(6-(benzo[d][1,3]dioxol-5-yl)-N-methyl-N-((4-methyl...)
Show SMILES CN(Cc1nc(C)cs1)c1ncnc2ccc(cc12)-c1ccc2OCOc2c1
Show InChI InChI=1S/C21H18N4O2S/c1-13-10-28-20(24-13)9-25(2)21-16-7-14(3-5-17(16)22-11-23-21)15-4-6-18-19(8-15)27-12-26-18/h3-8,10-11H,9,12H2,1-2H3
n/an/a 37n/an/an/an/an/an/a
National Human Genome Research Institute
Curated by ChEMBL
Assay Description
Inhibition of Clk4 kinase using ATP as substrate by 33P radiolabelled kinase assay
Bioorg Med Chem Lett 21: 3152-8 (2011)
Article DOI: 10.1016/j.bmcl.2011.02.114
BindingDB Entry DOI: 10.7270/Q2J67H83