null
SMILES: CN(C)c1ccc(cc1)C(=O)NCCCOc1ccc(cc1)S(=O)(=O)C1(CCOCC1)C(=O)NO
InChI Key: InChIKey=OICBVOJTVMMIHN-UHFFFAOYSA-N
Activity Spreadsheet -- Enzyme Inhibition Constant Data from BindingDB
Found 3 hits for monomerid = 50343053
Trg + Lig
Ki
nM
ΔG°
kcal/mole
IC50
nM
Kd
nM
EC50/IC50
nM
koff
s-1
kon
M-1s-1
pHTemp
°C
72 kDa type IV collagenase
(Homo sapiens (Human))
BDBM50343053
(4-(4-(3-(4-(dimethylamino)benzamido)propoxy)phenyl...)
Show SMILES CN(C)c1ccc(cc1)C(=O)NCCCOc1ccc(cc1)S(=O)(=O)C1(CCOCC1)C(=O)NO
Show InChI InChI=1S/C24H31N3O7S/c1-27(2)19-6-4-18(5-7-19)22(28)25-14-3-15-34-20-8-10-21(11-9-20)35(31,32)24(23(29)26-30)12-16-33-17-13-24/h4-11,30H,3,12-17H2,1-2H3,(H,25,28)(H,26,29)
Reactome pathway
n/an/a 1.10E+3n/an/an/an/an/an/a
Pfizer Inc.
Curated by ChEMBL
Assay Description
Inhibition of human MMP2
Bioorg Med Chem Lett 21: 2823-5 (2011)
Article DOI: 10.1016/j.bmcl.2011.03.095
BindingDB Entry DOI: 10.7270/Q2CF9QD0
Collagenase 3
(Homo sapiens (Human))
BDBM50343053
(4-(4-(3-(4-(dimethylamino)benzamido)propoxy)phenyl...)
Show SMILES CN(C)c1ccc(cc1)C(=O)NCCCOc1ccc(cc1)S(=O)(=O)C1(CCOCC1)C(=O)NO
Show InChI InChI=1S/C24H31N3O7S/c1-27(2)19-6-4-18(5-7-19)22(28)25-14-3-15-34-20-8-10-21(11-9-20)35(31,32)24(23(29)26-30)12-16-33-17-13-24/h4-11,30H,3,12-17H2,1-2H3,(H,25,28)(H,26,29)
NCI pathway
Reactome pathway
n/an/a 1.60n/an/an/an/an/an/a
Pfizer Inc.
Curated by ChEMBL
Assay Description
Inhibition of human MMP13
Bioorg Med Chem Lett 21: 2823-5 (2011)
Article DOI: 10.1016/j.bmcl.2011.03.095
BindingDB Entry DOI: 10.7270/Q2CF9QD0
Neutrophil collagenase
(Homo sapiens (Human))
BDBM50343053
(4-(4-(3-(4-(dimethylamino)benzamido)propoxy)phenyl...)
Show SMILES CN(C)c1ccc(cc1)C(=O)NCCCOc1ccc(cc1)S(=O)(=O)C1(CCOCC1)C(=O)NO
Show InChI InChI=1S/C24H31N3O7S/c1-27(2)19-6-4-18(5-7-19)22(28)25-14-3-15-34-20-8-10-21(11-9-20)35(31,32)24(23(29)26-30)12-16-33-17-13-24/h4-11,30H,3,12-17H2,1-2H3,(H,25,28)(H,26,29)
Reactome pathway
n/an/a 1.10E+3n/an/an/an/an/an/a
Pfizer Inc.
Curated by ChEMBL
Assay Description
Inhibition of human MMP8
Bioorg Med Chem Lett 21: 2823-5 (2011)
Article DOI: 10.1016/j.bmcl.2011.03.095
BindingDB Entry DOI: 10.7270/Q2CF9QD0