BDBM50343100 CHEMBL1771235::N-(3-ethoxyphenyl)-2-(pyridin-3-yl)-4-o-tolyl-7,8-dihydropyrido[4,3-d]pyrimidine-6(5H)-carboxamide
SMILES: CCOc1cccc(NC(=O)N2CCc3nc(nc(c3C2)-c2ccccc2C)-c2cccnc2)c1
InChI Key: InChIKey=IRAXLBFJJHMMEO-UHFFFAOYSA-N
Data: 1 IC50
Activity Spreadsheet -- Enzyme Inhibition Constant Data from BindingDB
Found 1 hit for monomerid = 50343100
Trg + Lig
Ki
nM
ΔG°
kcal/mole
IC50
nM
Kd
nM
EC50/IC50
nM
koff
s-1
kon
M-1s-1
pHTemp
°C
P2Y purinoceptor 14
(Mus musculus)
BDBM50343100
(CHEMBL1771235 | N-(3-ethoxyphenyl)-2-(pyridin-3-yl...)
Show SMILES CCOc1cccc(NC(=O)N2CCc3nc(nc(c3C2)-c2ccccc2C)-c2cccnc2)c1
Show InChI InChI=1S/C28H27N5O2/c1-3-35-22-11-6-10-21(16-22)30-28(34)33-15-13-25-24(18-33)26(23-12-5-4-8-19(23)2)32-27(31-25)20-9-7-14-29-17-20/h4-12,14,16-17H,3,13,15,18H2,1-2H3,(H,30,34)
Reactome pathway
n/an/a 420n/an/an/an/an/an/a
Merck Frosst Center for Therapeutic Research
Curated by ChEMBL
Assay Description
Antagonist activity at mouse P2Y14 expressed in human HEK cells coexpressing Galphai5 assessed as inhibition of UDP-glucose stimulated calcium releas...
Bioorg Med Chem Lett 21: 2832-5 (2011)
Article DOI: 10.1016/j.bmcl.2011.03.084
BindingDB Entry DOI: 10.7270/Q20865N7