BDBM50343102 2-(pyridin-3-yl)-N-m-tolyl-4-o-tolyl-7,8-dihydropyrido[4,3-d]pyrimidine-6(5H)-carboxamide::CHEMBL1771237
SMILES: Cc1cccc(NC(=O)N2CCc3nc(nc(c3C2)-c2ccccc2C)-c2cccnc2)c1
InChI Key: InChIKey=GOKMEAAWGZYTFZ-UHFFFAOYSA-N
Data: 1 IC50
Activity Spreadsheet -- Enzyme Inhibition Constant Data from BindingDB
Found 1 hit for monomerid = 50343102
Trg + Lig
Ki
nM
ΔG°
kcal/mole
IC50
nM
Kd
nM
EC50/IC50
nM
koff
s-1
kon
M-1s-1
pHTemp
°C
P2Y purinoceptor 14
(Mus musculus)
BDBM50343102
(2-(pyridin-3-yl)-N-m-tolyl-4-o-tolyl-7,8-dihydropy...)
Show SMILES Cc1cccc(NC(=O)N2CCc3nc(nc(c3C2)-c2ccccc2C)-c2cccnc2)c1
Show InChI InChI=1S/C27H25N5O/c1-18-7-5-10-21(15-18)29-27(33)32-14-12-24-23(17-32)25(22-11-4-3-8-19(22)2)31-26(30-24)20-9-6-13-28-16-20/h3-11,13,15-16H,12,14,17H2,1-2H3,(H,29,33)
Reactome pathway
n/an/a 1.90E+3n/an/an/an/an/an/a
Merck Frosst Center for Therapeutic Research
Curated by ChEMBL
Assay Description
Antagonist activity at mouse P2Y14 expressed in human HEK cells coexpressing Galphai5 assessed as inhibition of UDP-glucose stimulated calcium releas...
Bioorg Med Chem Lett 21: 2832-5 (2011)
Article DOI: 10.1016/j.bmcl.2011.03.084
BindingDB Entry DOI: 10.7270/Q20865N7