BDBM50343132 2-(3,5-dimethylisoxazol-4-yl)-N-(3-ethylphenyl)-4-o-tolyl-7,8-dihydropyrido[4,3-d]pyrimidine-6(5H)-carboxamide::CHEMBL1771460
SMILES: CCc1cccc(NC(=O)N2CCc3nc(nc(c3C2)-c2ccccc2C)-c2c(C)noc2C)c1
InChI Key: InChIKey=JUFJOGWAHDLPEF-UHFFFAOYSA-N
Data: 2 IC50
Activity Spreadsheet -- Enzyme Inhibition Constant Data from BindingDB
Found 2 hits for monomerid = 50343132
Trg + Lig
Ki
nM
ΔG°
kcal/mole
IC50
nM
Kd
nM
EC50/IC50
nM
koff
s-1
kon
M-1s-1
pHTemp
°C
Potassium voltage-gated channel subfamily H member 2
(Homo sapiens (Human))
BDBM50343132
(2-(3,5-dimethylisoxazol-4-yl)-N-(3-ethylphenyl)-4-...)
Show SMILES CCc1cccc(NC(=O)N2CCc3nc(nc(c3C2)-c2ccccc2C)-c2c(C)noc2C)c1
Show InChI InChI=1S/C28H29N5O2/c1-5-20-10-8-11-21(15-20)29-28(34)33-14-13-24-23(16-33)26(22-12-7-6-9-17(22)2)31-27(30-24)25-18(3)32-35-19(25)4/h6-12,15H,5,13-14,16H2,1-4H3,(H,29,34)
Reactome pathway
n/an/a>5.00E+3n/an/an/an/an/an/a
Merck Frosst Center for Therapeutic Research
Curated by ChEMBL
Assay Description
Displacement of [35S]MK-0499 from human ERG
Bioorg Med Chem Lett 21: 2832-5 (2011)
Article DOI: 10.1016/j.bmcl.2011.03.084
BindingDB Entry DOI: 10.7270/Q20865N7
P2Y purinoceptor 14
(Mus musculus)
BDBM50343132
(2-(3,5-dimethylisoxazol-4-yl)-N-(3-ethylphenyl)-4-...)
Show SMILES CCc1cccc(NC(=O)N2CCc3nc(nc(c3C2)-c2ccccc2C)-c2c(C)noc2C)c1
Show InChI InChI=1S/C28H29N5O2/c1-5-20-10-8-11-21(15-20)29-28(34)33-14-13-24-23(16-33)26(22-12-7-6-9-17(22)2)31-27(30-24)25-18(3)32-35-19(25)4/h6-12,15H,5,13-14,16H2,1-4H3,(H,29,34)
Reactome pathway
n/an/a 4n/an/an/an/an/an/a
Merck Frosst Center for Therapeutic Research
Curated by ChEMBL
Assay Description
Antagonist activity at mouse P2Y14 expressed in human HEK cells coexpressing Galphai5 assessed as inhibition of UDP-glucose stimulated calcium releas...
Bioorg Med Chem Lett 21: 2832-5 (2011)
Article DOI: 10.1016/j.bmcl.2011.03.084
BindingDB Entry DOI: 10.7270/Q20865N7