BDBM50343295 2-((4-(2-Methoxy-phenyl)piperidin-1-yl)methyl)-1-methyl-1H-benzo[d]imidazole::CHEMBL1774101
SMILES: COc1ccccc1C1CCN(Cc2nc3ccccc3n2C)CC1
InChI Key: InChIKey=MJDLYRJRCRLNGE-UHFFFAOYSA-N
Data: 1 KI  2 EC50
Activity Spreadsheet -- Enzyme Inhibition Constant Data from BindingDB
Found 3 hits for monomerid = 50343295
Trg + Lig
Ki
nM
ΔG°
kcal/mole
IC50
nM
Kd
nM
EC50/IC50
nM
koff
s-1
kon
M-1s-1
pHTemp
°C
D(2) dopamine receptor
(Rattus norvegicus (rat))
BDBM50343295
(2-((4-(2-Methoxy-phenyl)piperidin-1-yl)methyl)-1-m...)
Show SMILES COc1ccccc1C1CCN(Cc2nc3ccccc3n2C)CC1
Show InChI InChI=1S/C21H25N3O/c1-23-19-9-5-4-8-18(19)22-21(23)15-24-13-11-16(12-14-24)17-7-3-6-10-20(17)25-2/h3-10,16H,11-15H2,1-2H3
Reactome pathway
426n/an/an/an/an/an/an/an/a
Pfizer Inc.
Curated by ChEMBL
Assay Description
Displacement of [3H]spiperone from dopamine D2 receptor in rat corpus striatum by beta plate scintillation counting
J Med Chem 54: 1724-39 (2011)
Article DOI: 10.1021/jm101414h
BindingDB Entry DOI: 10.7270/Q2222V3C
D(2) dopamine receptor
(Homo sapiens (Human))
BDBM50343295
(2-((4-(2-Methoxy-phenyl)piperidin-1-yl)methyl)-1-m...)
Show SMILES COc1ccccc1C1CCN(Cc2nc3ccccc3n2C)CC1
Show InChI InChI=1S/C21H25N3O/c1-23-19-9-5-4-8-18(19)22-21(23)15-24-13-11-16(12-14-24)17-7-3-6-10-20(17)25-2/h3-10,16H,11-15H2,1-2H3
Reactome pathway
n/an/an/an/a 951n/an/an/an/a
Pfizer Inc.
Curated by ChEMBL
Assay Description
Antagonist activity at human dopamine D2 receptor expressed in CHO cells assessed as inhibition of quinpirole-induced effect
J Med Chem 54: 1724-39 (2011)
Article DOI: 10.1021/jm101414h
BindingDB Entry DOI: 10.7270/Q2222V3C
Metabotropic glutamate receptor 2
(Homo sapiens (Human))
BDBM50343295
(2-((4-(2-Methoxy-phenyl)piperidin-1-yl)methyl)-1-m...)
Show SMILES COc1ccccc1C1CCN(Cc2nc3ccccc3n2C)CC1
Show InChI InChI=1S/C21H25N3O/c1-23-19-9-5-4-8-18(19)22-21(23)15-24-13-11-16(12-14-24)17-7-3-6-10-20(17)25-2/h3-10,16H,11-15H2,1-2H3
n/an/an/an/a 87n/an/an/an/a
Pfizer Inc.
Curated by ChEMBL
Assay Description
Positive allosteric modulation of rat mGluR2 expressed in HEK293 cells co-expressing Galpha15 G protein assessed as increase in glutamate-induced int...
J Med Chem 54: 1724-39 (2011)
Article DOI: 10.1021/jm101414h
BindingDB Entry DOI: 10.7270/Q2222V3C