null
SMILES: Cn1c(CN2CCC(CC2)c2ccccc2F)nc2ccccc12
InChI Key: InChIKey=AMADNKXMEDYTCS-UHFFFAOYSA-N
Activity Spreadsheet -- Enzyme Inhibition Constant Data from BindingDB
Found 12 hits for monomerid = 50343299
Trg + Lig
Ki
nM
ΔG°
kcal/mole
IC50
nM
Kd
nM
EC50/IC50
nM
koff
s-1
kon
M-1s-1
pHTemp
°C
D(2) dopamine receptor
(Homo sapiens (Human))
BDBM50343299
(2-((4-(2-Fluorophenyl)piperidin-1-yl)methyl)-1-met...)
Show SMILES Cn1c(CN2CCC(CC2)c2ccccc2F)nc2ccccc12
Show InChI InChI=1S/C20H22FN3/c1-23-19-9-5-4-8-18(19)22-20(23)14-24-12-10-15(11-13-24)16-6-2-3-7-17(16)21/h2-9,15H,10-14H2,1H3
Reactome pathway
39.8n/an/an/an/an/an/an/an/a
GlaxoSmithKline
Curated by ChEMBL
Assay Description
Antagonist activity at human D2 receptor expressed in CHO cells co-expressing G0 by [35S]GTPgammaS binding assay
Bioorg Med Chem Lett 20: 759-62 (2010)
Article DOI: 10.1016/j.bmcl.2009.11.032
BindingDB Entry DOI: 10.7270/Q2CC11XQ
D(2) dopamine receptor
(Rattus norvegicus (rat))
BDBM50343299
(2-((4-(2-Fluorophenyl)piperidin-1-yl)methyl)-1-met...)
Show SMILES Cn1c(CN2CCC(CC2)c2ccccc2F)nc2ccccc12
Show InChI InChI=1S/C20H22FN3/c1-23-19-9-5-4-8-18(19)22-20(23)14-24-12-10-15(11-13-24)16-6-2-3-7-17(16)21/h2-9,15H,10-14H2,1H3
Reactome pathway
93n/an/an/an/an/an/an/an/a
Pfizer Inc.
Curated by ChEMBL
Assay Description
Displacement of [3H]spiperone from dopamine D2 receptor in rat corpus striatum by beta plate scintillation counting
J Med Chem 54: 1724-39 (2011)
Article DOI: 10.1021/jm101414h
BindingDB Entry DOI: 10.7270/Q2222V3C
D(3) dopamine receptor
(Homo sapiens (Human))
BDBM50343299
(2-((4-(2-Fluorophenyl)piperidin-1-yl)methyl)-1-met...)
Show SMILES Cn1c(CN2CCC(CC2)c2ccccc2F)nc2ccccc12
Show InChI InChI=1S/C20H22FN3/c1-23-19-9-5-4-8-18(19)22-20(23)14-24-12-10-15(11-13-24)16-6-2-3-7-17(16)21/h2-9,15H,10-14H2,1H3
100n/an/an/an/an/an/an/an/a
GlaxoSmithKline
Curated by ChEMBL
Assay Description
Antagonist activity at human D3 receptor expressed in CHO cells co-expressing G0 by [35S]GTPgammaS binding assay
Bioorg Med Chem Lett 20: 759-62 (2010)
Article DOI: 10.1016/j.bmcl.2009.11.032
BindingDB Entry DOI: 10.7270/Q2CC11XQ
Metabotropic glutamate receptor 5
(Homo sapiens (Human))
BDBM50343299
(2-((4-(2-Fluorophenyl)piperidin-1-yl)methyl)-1-met...)
Show SMILES Cn1c(CN2CCC(CC2)c2ccccc2F)nc2ccccc12
Show InChI InChI=1S/C20H22FN3/c1-23-19-9-5-4-8-18(19)22-20(23)14-24-12-10-15(11-13-24)16-6-2-3-7-17(16)21/h2-9,15H,10-14H2,1H3
n/an/an/an/a>1.58E+4n/an/an/an/a
GlaxoSmithKline
Curated by ChEMBL
Assay Description
Agonist activity at mGluR5
Bioorg Med Chem Lett 20: 759-62 (2010)
Article DOI: 10.1016/j.bmcl.2009.11.032
BindingDB Entry DOI: 10.7270/Q2CC11XQ
Metabotropic glutamate receptor 2
(Homo sapiens (Human))
BDBM50343299
(2-((4-(2-Fluorophenyl)piperidin-1-yl)methyl)-1-met...)
Show SMILES Cn1c(CN2CCC(CC2)c2ccccc2F)nc2ccccc12
Show InChI InChI=1S/C20H22FN3/c1-23-19-9-5-4-8-18(19)22-20(23)14-24-12-10-15(11-13-24)16-6-2-3-7-17(16)21/h2-9,15H,10-14H2,1H3
n/an/an/an/a 130n/an/an/an/a
TBA
Citation and Details
Metabotropic glutamate receptor 5
(Homo sapiens (Human))
BDBM50343299
(2-((4-(2-Fluorophenyl)piperidin-1-yl)methyl)-1-met...)
Show SMILES Cn1c(CN2CCC(CC2)c2ccccc2F)nc2ccccc12
Show InChI InChI=1S/C20H22FN3/c1-23-19-9-5-4-8-18(19)22-20(23)14-24-12-10-15(11-13-24)16-6-2-3-7-17(16)21/h2-9,15H,10-14H2,1H3
n/an/an/an/a>1.58E+4n/an/an/an/a
GlaxoSmithKline
Curated by ChEMBL
Assay Description
Positive modulation of mGluR5
Bioorg Med Chem Lett 20: 759-62 (2010)
Article DOI: 10.1016/j.bmcl.2009.11.032
BindingDB Entry DOI: 10.7270/Q2CC11XQ
Metabotropic glutamate receptor 2
(Homo sapiens (Human))
BDBM50343299
(2-((4-(2-Fluorophenyl)piperidin-1-yl)methyl)-1-met...)
Show SMILES Cn1c(CN2CCC(CC2)c2ccccc2F)nc2ccccc12
Show InChI InChI=1S/C20H22FN3/c1-23-19-9-5-4-8-18(19)22-20(23)14-24-12-10-15(11-13-24)16-6-2-3-7-17(16)21/h2-9,15H,10-14H2,1H3
n/an/an/an/a 126n/an/an/an/a
GlaxoSmithKline
Curated by ChEMBL
Assay Description
Positive modulation of human mGluR2 expressed in CHO cells co-expressing Ga16 G-protein assessed as glutamate-induced response by FLIPR assay
Bioorg Med Chem Lett 20: 759-62 (2010)
Article DOI: 10.1016/j.bmcl.2009.11.032
BindingDB Entry DOI: 10.7270/Q2CC11XQ
Metabotropic glutamate receptor 2
(Homo sapiens (Human))
BDBM50343299
(2-((4-(2-Fluorophenyl)piperidin-1-yl)methyl)-1-met...)
Show SMILES Cn1c(CN2CCC(CC2)c2ccccc2F)nc2ccccc12
Show InChI InChI=1S/C20H22FN3/c1-23-19-9-5-4-8-18(19)22-20(23)14-24-12-10-15(11-13-24)16-6-2-3-7-17(16)21/h2-9,15H,10-14H2,1H3
n/an/an/an/a 3.98E+3n/an/an/an/a
GlaxoSmithKline
Curated by ChEMBL
Assay Description
Agonist activity at human mGluR2 expressed in CHO cells co-expressing Ga16 G-protein assessed as glutamate-induced response by FLIPR assay
Bioorg Med Chem Lett 20: 759-62 (2010)
Article DOI: 10.1016/j.bmcl.2009.11.032
BindingDB Entry DOI: 10.7270/Q2CC11XQ
Metabotropic glutamate receptor 1
(Homo sapiens (Human))
BDBM50343299
(2-((4-(2-Fluorophenyl)piperidin-1-yl)methyl)-1-met...)
Show SMILES Cn1c(CN2CCC(CC2)c2ccccc2F)nc2ccccc12
Show InChI InChI=1S/C20H22FN3/c1-23-19-9-5-4-8-18(19)22-20(23)14-24-12-10-15(11-13-24)16-6-2-3-7-17(16)21/h2-9,15H,10-14H2,1H3
n/an/an/an/a>1.58E+4n/an/an/an/a
GlaxoSmithKline
Curated by ChEMBL
Assay Description
Antagonist activity at mGluR1
Bioorg Med Chem Lett 20: 759-62 (2010)
Article DOI: 10.1016/j.bmcl.2009.11.032
BindingDB Entry DOI: 10.7270/Q2CC11XQ
Metabotropic glutamate receptor 1
(Homo sapiens (Human))
BDBM50343299
(2-((4-(2-Fluorophenyl)piperidin-1-yl)methyl)-1-met...)
Show SMILES Cn1c(CN2CCC(CC2)c2ccccc2F)nc2ccccc12
Show InChI InChI=1S/C20H22FN3/c1-23-19-9-5-4-8-18(19)22-20(23)14-24-12-10-15(11-13-24)16-6-2-3-7-17(16)21/h2-9,15H,10-14H2,1H3
n/an/an/an/a>1.58E+4n/an/an/an/a
GlaxoSmithKline
Curated by ChEMBL
Assay Description
Agonist activity at mGluR1
Bioorg Med Chem Lett 20: 759-62 (2010)
Article DOI: 10.1016/j.bmcl.2009.11.032
BindingDB Entry DOI: 10.7270/Q2CC11XQ
Metabotropic glutamate receptor 2
(Homo sapiens (Human))
BDBM50343299
(2-((4-(2-Fluorophenyl)piperidin-1-yl)methyl)-1-met...)
Show SMILES Cn1c(CN2CCC(CC2)c2ccccc2F)nc2ccccc12
Show InChI InChI=1S/C20H22FN3/c1-23-19-9-5-4-8-18(19)22-20(23)14-24-12-10-15(11-13-24)16-6-2-3-7-17(16)21/h2-9,15H,10-14H2,1H3
n/an/an/an/a 22n/an/an/an/a
Pfizer Inc.
Curated by ChEMBL
Assay Description
Positive allosteric modulation of rat mGluR2 expressed in HEK293 cells co-expressing Galpha15 G protein assessed as increase in glutamate-induced int...
J Med Chem 54: 1724-39 (2011)
Article DOI: 10.1021/jm101414h
BindingDB Entry DOI: 10.7270/Q2222V3C
Metabotropic glutamate receptor 5
(Homo sapiens (Human))
BDBM50343299
(2-((4-(2-Fluorophenyl)piperidin-1-yl)methyl)-1-met...)
Show SMILES Cn1c(CN2CCC(CC2)c2ccccc2F)nc2ccccc12
Show InChI InChI=1S/C20H22FN3/c1-23-19-9-5-4-8-18(19)22-20(23)14-24-12-10-15(11-13-24)16-6-2-3-7-17(16)21/h2-9,15H,10-14H2,1H3
n/an/an/an/a>1.58E+4n/an/an/an/a
GlaxoSmithKline
Curated by ChEMBL
Assay Description
Antagonist activity at mGluR5
Bioorg Med Chem Lett 20: 759-62 (2010)
Article DOI: 10.1016/j.bmcl.2009.11.032
BindingDB Entry DOI: 10.7270/Q2CC11XQ