BDBM50343301 2-((4-(4-Fluorophenyl)piperidin-1-yl)methyl)-1-methyl-1H-benzo-[d]imidazole::CHEMBL1774103
SMILES: Cn1c(CN2CCC(CC2)c2ccc(F)cc2)nc2ccccc12
InChI Key: InChIKey=YEJCZFQPJIMMCF-UHFFFAOYSA-N
Data: 1 KI  1 EC50
Activity Spreadsheet -- Enzyme Inhibition Constant Data from BindingDB
Found 2 hits for monomerid = 50343301
Trg + Lig
Ki
nM
ΔG°
kcal/mole
IC50
nM
Kd
nM
EC50/IC50
nM
koff
s-1
kon
M-1s-1
pHTemp
°C
D(2) dopamine receptor
(Rattus norvegicus (rat))
BDBM50343301
(2-((4-(4-Fluorophenyl)piperidin-1-yl)methyl)-1-met...)
Show SMILES Cn1c(CN2CCC(CC2)c2ccc(F)cc2)nc2ccccc12
Show InChI InChI=1S/C20H22FN3/c1-23-19-5-3-2-4-18(19)22-20(23)14-24-12-10-16(11-13-24)15-6-8-17(21)9-7-15/h2-9,16H,10-14H2,1H3
Reactome pathway
24n/an/an/an/an/an/an/an/a
Pfizer Inc.
Curated by ChEMBL
Assay Description
Displacement of [3H]spiperone from dopamine D2 receptor in rat corpus striatum by beta plate scintillation counting
J Med Chem 54: 1724-39 (2011)
Article DOI: 10.1021/jm101414h
BindingDB Entry DOI: 10.7270/Q2222V3C
Metabotropic glutamate receptor 2
(Homo sapiens (Human))
BDBM50343301
(2-((4-(4-Fluorophenyl)piperidin-1-yl)methyl)-1-met...)
Show SMILES Cn1c(CN2CCC(CC2)c2ccc(F)cc2)nc2ccccc12
Show InChI InChI=1S/C20H22FN3/c1-23-19-5-3-2-4-18(19)22-20(23)14-24-12-10-16(11-13-24)15-6-8-17(21)9-7-15/h2-9,16H,10-14H2,1H3
n/an/an/an/a 159n/an/an/an/a
Pfizer Inc.
Curated by ChEMBL
Assay Description
Positive allosteric modulation of rat mGluR2 expressed in HEK293 cells co-expressing Galpha15 G protein assessed as increase in glutamate-induced int...
J Med Chem 54: 1724-39 (2011)
Article DOI: 10.1021/jm101414h
BindingDB Entry DOI: 10.7270/Q2222V3C