null
SMILES: Cn1c(CN2CCC(CC2)c2ccc(cc2)C(F)(F)F)nc2ncccc12
InChI Key: InChIKey=JJJUTEJMSCWLKG-UHFFFAOYSA-N
Activity Spreadsheet -- Enzyme Inhibition Constant Data from BindingDB
Found 3 hits for monomerid = 50343308
Trg + Lig
Ki
nM
ΔG°
kcal/mole
IC50
nM
Kd
nM
EC50/IC50
nM
koff
s-1
kon
M-1s-1
pHTemp
°C
D(2) dopamine receptor
(Rattus norvegicus (rat))
BDBM50343308
(1-Methyl-2-((4-(4-(trifluoromethyl)phenyl)piperidi...)
Show SMILES Cn1c(CN2CCC(CC2)c2ccc(cc2)C(F)(F)F)nc2ncccc12
Show InChI InChI=1S/C20H21F3N4/c1-26-17-3-2-10-24-19(17)25-18(26)13-27-11-8-15(9-12-27)14-4-6-16(7-5-14)20(21,22)23/h2-7,10,15H,8-9,11-13H2,1H3
Reactome pathway
404n/an/an/an/an/an/an/an/a
Pfizer Inc.
Curated by ChEMBL
Assay Description
Displacement of [3H]spiperone from dopamine D2 receptor in rat corpus striatum by beta plate scintillation counting
J Med Chem 54: 1724-39 (2011)
Article DOI: 10.1021/jm101414h
BindingDB Entry DOI: 10.7270/Q2222V3C
Metabotropic glutamate receptor 2
(Homo sapiens (Human))
BDBM50343308
(1-Methyl-2-((4-(4-(trifluoromethyl)phenyl)piperidi...)
Show SMILES Cn1c(CN2CCC(CC2)c2ccc(cc2)C(F)(F)F)nc2ncccc12
Show InChI InChI=1S/C20H21F3N4/c1-26-17-3-2-10-24-19(17)25-18(26)13-27-11-8-15(9-12-27)14-4-6-16(7-5-14)20(21,22)23/h2-7,10,15H,8-9,11-13H2,1H3
n/an/an/an/a 43n/an/an/an/a
Pfizer Inc.
Curated by ChEMBL
Assay Description
Positive allosteric modulation of human mGluR2 expressed in HEK293 cells co-expressing Galpha15 G protein assessed as increase in glutamate-induced i...
J Med Chem 54: 1724-39 (2011)
Article DOI: 10.1021/jm101414h
BindingDB Entry DOI: 10.7270/Q2222V3C
Metabotropic glutamate receptor 2
(Homo sapiens (Human))
BDBM50343308
(1-Methyl-2-((4-(4-(trifluoromethyl)phenyl)piperidi...)
Show SMILES Cn1c(CN2CCC(CC2)c2ccc(cc2)C(F)(F)F)nc2ncccc12
Show InChI InChI=1S/C20H21F3N4/c1-26-17-3-2-10-24-19(17)25-18(26)13-27-11-8-15(9-12-27)14-4-6-16(7-5-14)20(21,22)23/h2-7,10,15H,8-9,11-13H2,1H3
n/an/an/an/a 48n/an/an/an/a
Pfizer Inc.
Curated by ChEMBL
Assay Description
Positive allosteric modulation of rat mGluR2 expressed in HEK293 cells co-expressing Galpha15 G protein assessed as increase in glutamate-induced int...
J Med Chem 54: 1724-39 (2011)
Article DOI: 10.1021/jm101414h
BindingDB Entry DOI: 10.7270/Q2222V3C