BDBM50343312 2-((4-(2-Methoxy-4-(trifluoromethyl)phenyl)piperidin-1-yl)methyl)-1-methyl-1H-imidazo[4,5-b]pyridine::CHEMBL1774112
SMILES: COc1cc(ccc1C1CCN(Cc2nc3ncccc3n2C)CC1)C(F)(F)F
InChI Key: InChIKey=OQNTWJNDKUVZAQ-UHFFFAOYSA-N
Data: 1 KI  1 EC50
Activity Spreadsheet -- Enzyme Inhibition Constant Data from BindingDB
Found 2 hits for monomerid = 50343312
Trg + Lig
Ki
nM
ΔG°
kcal/mole
IC50
nM
Kd
nM
EC50/IC50
nM
koff
s-1
kon
M-1s-1
pHTemp
°C
D(2) dopamine receptor
(Rattus norvegicus (rat))
BDBM50343312
(2-((4-(2-Methoxy-4-(trifluoromethyl)phenyl)piperid...)
Show SMILES COc1cc(ccc1C1CCN(Cc2nc3ncccc3n2C)CC1)C(F)(F)F
Show InChI InChI=1S/C21H23F3N4O/c1-27-17-4-3-9-25-20(17)26-19(27)13-28-10-7-14(8-11-28)16-6-5-15(21(22,23)24)12-18(16)29-2/h3-6,9,12,14H,7-8,10-11,13H2,1-2H3
Reactome pathway
2.43E+3n/an/an/an/an/an/an/an/a
Pfizer Inc.
Curated by ChEMBL
Assay Description
Displacement of [3H]spiperone from dopamine D2 receptor in rat corpus striatum by beta plate scintillation counting
J Med Chem 54: 1724-39 (2011)
Article DOI: 10.1021/jm101414h
BindingDB Entry DOI: 10.7270/Q2222V3C
Metabotropic glutamate receptor 2
(Homo sapiens (Human))
BDBM50343312
(2-((4-(2-Methoxy-4-(trifluoromethyl)phenyl)piperid...)
Show SMILES COc1cc(ccc1C1CCN(Cc2nc3ncccc3n2C)CC1)C(F)(F)F
Show InChI InChI=1S/C21H23F3N4O/c1-27-17-4-3-9-25-20(17)26-19(27)13-28-10-7-14(8-11-28)16-6-5-15(21(22,23)24)12-18(16)29-2/h3-6,9,12,14H,7-8,10-11,13H2,1-2H3
n/an/an/an/a 13n/an/an/an/a
Pfizer Inc.
Curated by ChEMBL
Assay Description
Positive allosteric modulation of rat mGluR2 expressed in HEK293 cells co-expressing Galpha15 G protein assessed as increase in glutamate-induced int...
J Med Chem 54: 1724-39 (2011)
Article DOI: 10.1021/jm101414h
BindingDB Entry DOI: 10.7270/Q2222V3C