null
SMILES: Cn1c(CN2CCC(CC2)c2ccc(cc2F)C(F)(F)F)nc2ncccc12
InChI Key: InChIKey=KOJZZXZYGJZWMH-UHFFFAOYSA-N
Activity Spreadsheet -- Enzyme Inhibition Constant Data from BindingDB
Found 2 hits for monomerid = 50343313
Trg + Lig
Ki
nM
ΔG°
kcal/mole
IC50
nM
Kd
nM
EC50/IC50
nM
koff
s-1
kon
M-1s-1
pHTemp
°C
D(2) dopamine receptor
(Rattus norvegicus (rat))
BDBM50343313
(2-((4-(2-Fluoro-4-(trifluoromethyl)phenyl)piperidi...)
Show SMILES Cn1c(CN2CCC(CC2)c2ccc(cc2F)C(F)(F)F)nc2ncccc12
Show InChI InChI=1S/C20H20F4N4/c1-27-17-3-2-8-25-19(17)26-18(27)12-28-9-6-13(7-10-28)15-5-4-14(11-16(15)21)20(22,23)24/h2-5,8,11,13H,6-7,9-10,12H2,1H3
Reactome pathway
1.78E+3n/an/an/an/an/an/an/an/a
Pfizer Inc.
Curated by ChEMBL
Assay Description
Displacement of [3H]spiperone from dopamine D2 receptor in rat corpus striatum by beta plate scintillation counting
J Med Chem 54: 1724-39 (2011)
Article DOI: 10.1021/jm101414h
BindingDB Entry DOI: 10.7270/Q2222V3C
Metabotropic glutamate receptor 2
(Homo sapiens (Human))
BDBM50343313
(2-((4-(2-Fluoro-4-(trifluoromethyl)phenyl)piperidi...)
Show SMILES Cn1c(CN2CCC(CC2)c2ccc(cc2F)C(F)(F)F)nc2ncccc12
Show InChI InChI=1S/C20H20F4N4/c1-27-17-3-2-8-25-19(17)26-18(27)12-28-9-6-13(7-10-28)15-5-4-14(11-16(15)21)20(22,23)24/h2-5,8,11,13H,6-7,9-10,12H2,1H3
n/an/an/an/a 25.1n/an/an/an/a
Pfizer Inc.
Curated by ChEMBL
Assay Description
Positive allosteric modulation of rat mGluR2 expressed in HEK293 cells co-expressing Galpha15 G protein assessed as increase in glutamate-induced int...
J Med Chem 54: 1724-39 (2011)
Article DOI: 10.1021/jm101414h
BindingDB Entry DOI: 10.7270/Q2222V3C