BDBM50343547 (2-Oxaadamant-1-yl)amine::2-Oxa-tricyclo[3.3.1.1(3,7)]dec-1-ylamine::CHEMBL472275
SMILES: NC12CC3CC(CC(C3)O1)C2
InChI Key: InChIKey=ZZLQURFGCICSRP-UHFFFAOYSA-N
Data: 1 IC50
Activity Spreadsheet -- Enzyme Inhibition Constant Data from BindingDB
Found 1 hit for monomerid = 50343547
Trg + Lig
Ki
nM
ΔG°
kcal/mole
IC50
nM
Kd
nM
EC50/IC50
nM
koff
s-1
kon
M-1s-1
pHTemp
°C
Matrix protein 2
(Influenza A virus)
BDBM50343547
((2-Oxaadamant-1-yl)amine | 2-Oxa-tricyclo[3.3.1.1(...)
Show SMILES NC12CC3CC(CC(C3)O1)C2 |TLB:0:1:4:8.7.6,THB:2:3:6:10.1.9,2:1:4.3.8:6,9:1:4:8.7.6,9:7:4:10.2.1,0:1:4.3.8:6|
Show InChI InChI=1S/C9H15NO/c10-9-4-6-1-7(5-9)3-8(2-6)11-9/h6-8H,1-5,10H2
n/an/a 2.92E+4n/an/an/an/an/an/a
Universitat de Barcelona
Curated by ChEMBL
Assay Description
Inhibition of Influenza A virus (A/Udorn/72) wild type matrix protein 2 expressed in xenopus oocytes after 2 mins by two-electrode voltage clamp assa...
J Med Chem 54: 2646-57 (2011)
Article DOI: 10.1021/jm101334y
BindingDB Entry DOI: 10.7270/Q2H41RR0