null
SMILES: CO[C@@]12CCCC[C@@]11CCN(CC3CCC3)[C@@H]2Cc2ccc(OC(=O)CCCCCCCCC(=O)Oc3ccc4C[C@H]5N(CC=C)CC[C@@]67[C@@H](Oc3c46)C(=O)CC[C@@]57O)cc12
InChI Key: InChIKey=SBPDOXVIBVEBTB-UEIGNXNKSA-N
Activity Spreadsheet -- Enzyme Inhibition Constant Data from BindingDB
Found 7 hits for monomerid = 50343626
Trg + Lig
Ki
nM
ΔG°
kcal/mole
IC50
nM
Kd
nM
EC50/IC50
nM
koff
s-1
kon
M-1s-1
pHTemp
°C
Kappa-type opioid receptor
(Homo sapiens (Human))
BDBM50343626
((5alpha)-17-Allyl-14-hydroxy-6-oxo-4,5-epoxymorphi...)
Show SMILES CO[C@@]12CCCC[C@@]11CCN(CC3CCC3)[C@@H]2Cc2ccc(OC(=O)CCCCCCCCC(=O)Oc3ccc4C[C@H]5N(CC=C)CC[C@@]67[C@@H](Oc3c46)C(=O)CC[C@@]57O)cc12 |r,TLB:11:10:18.60.17:2|
Show InChI InChI=1S/C51H66N2O8/c1-3-27-52-29-26-49-45-36-18-20-40(46(45)61-47(49)39(54)21-24-50(49,57)41(52)31-36)60-44(56)16-9-7-5-4-6-8-15-43(55)59-37-19-17-35-30-42-51(58-2)23-11-10-22-48(51,38(35)32-37)25-28-53(42)33-34-13-12-14-34/h3,17-20,32,34,41-42,47,57H,1,4-16,21-31,33H2,2H3/t41-,42-,47+,48+,49+,50-,51-/m1/s1
Reactome pathway
0.140n/an/an/an/an/an/an/an/a
Harvard Medical School
Curated by ChEMBL
Assay Description
Displacement of [3H]U69563 from human kappa-opioid receptor expressed in CHO cells after 60 mins by scintillation counting
Bioorg Med Chem 19: 2808-16 (2011)
Article DOI: 10.1016/j.bmc.2011.03.052
BindingDB Entry DOI: 10.7270/Q2KW5GB1
Mu-type opioid receptor
(Homo sapiens (Human))
BDBM50343626
((5alpha)-17-Allyl-14-hydroxy-6-oxo-4,5-epoxymorphi...)
Show SMILES CO[C@@]12CCCC[C@@]11CCN(CC3CCC3)[C@@H]2Cc2ccc(OC(=O)CCCCCCCCC(=O)Oc3ccc4C[C@H]5N(CC=C)CC[C@@]67[C@@H](Oc3c46)C(=O)CC[C@@]57O)cc12 |r,TLB:11:10:18.60.17:2|
Show InChI InChI=1S/C51H66N2O8/c1-3-27-52-29-26-49-45-36-18-20-40(46(45)61-47(49)39(54)21-24-50(49,57)41(52)31-36)60-44(56)16-9-7-5-4-6-8-15-43(55)59-37-19-17-35-30-42-51(58-2)23-11-10-22-48(51,38(35)32-37)25-28-53(42)33-34-13-12-14-34/h3,17-20,32,34,41-42,47,57H,1,4-16,21-31,33H2,2H3/t41-,42-,47+,48+,49+,50-,51-/m1/s1
NCI pathway
Reactome pathway
0.550n/an/an/an/an/an/an/an/a
Harvard Medical School
Curated by ChEMBL
Assay Description
Displacement of [3H]DAMGO from human mu-opioid receptor expressed in CHO cells after 60 mins by scintillation counting
Bioorg Med Chem 19: 2808-16 (2011)
Article DOI: 10.1016/j.bmc.2011.03.052
BindingDB Entry DOI: 10.7270/Q2KW5GB1
Delta-type opioid receptor
(Homo sapiens (Human))
BDBM50343626
((5alpha)-17-Allyl-14-hydroxy-6-oxo-4,5-epoxymorphi...)
Show SMILES CO[C@@]12CCCC[C@@]11CCN(CC3CCC3)[C@@H]2Cc2ccc(OC(=O)CCCCCCCCC(=O)Oc3ccc4C[C@H]5N(CC=C)CC[C@@]67[C@@H](Oc3c46)C(=O)CC[C@@]57O)cc12 |r,TLB:11:10:18.60.17:2|
Show InChI InChI=1S/C51H66N2O8/c1-3-27-52-29-26-49-45-36-18-20-40(46(45)61-47(49)39(54)21-24-50(49,57)41(52)31-36)60-44(56)16-9-7-5-4-6-8-15-43(55)59-37-19-17-35-30-42-51(58-2)23-11-10-22-48(51,38(35)32-37)25-28-53(42)33-34-13-12-14-34/h3,17-20,32,34,41-42,47,57H,1,4-16,21-31,33H2,2H3/t41-,42-,47+,48+,49+,50-,51-/m1/s1
Reactome pathway
39n/an/an/an/an/an/an/an/a
Harvard Medical School
Curated by ChEMBL
Assay Description
Displacement of [3H]naltrindole from human delta-opioid receptor expressed in CHO cells after 3 hrs by scintillation counting
Bioorg Med Chem 19: 2808-16 (2011)
Article DOI: 10.1016/j.bmc.2011.03.052
BindingDB Entry DOI: 10.7270/Q2KW5GB1
Mu-type opioid receptor
(Homo sapiens (Human))
BDBM50343626
((5alpha)-17-Allyl-14-hydroxy-6-oxo-4,5-epoxymorphi...)
Show SMILES CO[C@@]12CCCC[C@@]11CCN(CC3CCC3)[C@@H]2Cc2ccc(OC(=O)CCCCCCCCC(=O)Oc3ccc4C[C@H]5N(CC=C)CC[C@@]67[C@@H](Oc3c46)C(=O)CC[C@@]57O)cc12 |r,TLB:11:10:18.60.17:2|
Show InChI InChI=1S/C51H66N2O8/c1-3-27-52-29-26-49-45-36-18-20-40(46(45)61-47(49)39(54)21-24-50(49,57)41(52)31-36)60-44(56)16-9-7-5-4-6-8-15-43(55)59-37-19-17-35-30-42-51(58-2)23-11-10-22-48(51,38(35)32-37)25-28-53(42)33-34-13-12-14-34/h3,17-20,32,34,41-42,47,57H,1,4-16,21-31,33H2,2H3/t41-,42-,47+,48+,49+,50-,51-/m1/s1
NCI pathway
Reactome pathway
n/an/an/an/a 10n/an/an/an/a
Harvard Medical School
Curated by ChEMBL
Assay Description
Agonist activity at human mu-opioid receptor expressed in CHO cells assessed as stimulation of [35S]GTPgammaS binding after 60 mins by scintillation ...
Bioorg Med Chem 19: 2808-16 (2011)
Article DOI: 10.1016/j.bmc.2011.03.052
BindingDB Entry DOI: 10.7270/Q2KW5GB1
Mu-type opioid receptor
(Homo sapiens (Human))
BDBM50343626
((5alpha)-17-Allyl-14-hydroxy-6-oxo-4,5-epoxymorphi...)
Show SMILES CO[C@@]12CCCC[C@@]11CCN(CC3CCC3)[C@@H]2Cc2ccc(OC(=O)CCCCCCCCC(=O)Oc3ccc4C[C@H]5N(CC=C)CC[C@@]67[C@@H](Oc3c46)C(=O)CC[C@@]57O)cc12 |r,TLB:11:10:18.60.17:2|
Show InChI InChI=1S/C51H66N2O8/c1-3-27-52-29-26-49-45-36-18-20-40(46(45)61-47(49)39(54)21-24-50(49,57)41(52)31-36)60-44(56)16-9-7-5-4-6-8-15-43(55)59-37-19-17-35-30-42-51(58-2)23-11-10-22-48(51,38(35)32-37)25-28-53(42)33-34-13-12-14-34/h3,17-20,32,34,41-42,47,57H,1,4-16,21-31,33H2,2H3/t41-,42-,47+,48+,49+,50-,51-/m1/s1
NCI pathway
Reactome pathway
n/an/a 19n/an/an/an/an/an/a
Harvard Medical School
Curated by ChEMBL
Assay Description
Antagonist activity at human mu-opioid receptor expressed in CHO cells assessed as inhibition of DAMGO-induced [35S]GTPgammaS binding after 60 mins b...
Bioorg Med Chem 19: 2808-16 (2011)
Article DOI: 10.1016/j.bmc.2011.03.052
BindingDB Entry DOI: 10.7270/Q2KW5GB1
Kappa-type opioid receptor
(Homo sapiens (Human))
BDBM50343626
((5alpha)-17-Allyl-14-hydroxy-6-oxo-4,5-epoxymorphi...)
Show SMILES CO[C@@]12CCCC[C@@]11CCN(CC3CCC3)[C@@H]2Cc2ccc(OC(=O)CCCCCCCCC(=O)Oc3ccc4C[C@H]5N(CC=C)CC[C@@]67[C@@H](Oc3c46)C(=O)CC[C@@]57O)cc12 |r,TLB:11:10:18.60.17:2|
Show InChI InChI=1S/C51H66N2O8/c1-3-27-52-29-26-49-45-36-18-20-40(46(45)61-47(49)39(54)21-24-50(49,57)41(52)31-36)60-44(56)16-9-7-5-4-6-8-15-43(55)59-37-19-17-35-30-42-51(58-2)23-11-10-22-48(51,38(35)32-37)25-28-53(42)33-34-13-12-14-34/h3,17-20,32,34,41-42,47,57H,1,4-16,21-31,33H2,2H3/t41-,42-,47+,48+,49+,50-,51-/m1/s1
Reactome pathway
n/an/an/an/a 18n/an/an/an/a
Harvard Medical School
Curated by ChEMBL
Assay Description
Agonist activity at human kappa-opioid receptor expressed in CHO cells assessed as stimulation of [35S]GTPgammaS binding after 60 mins by scintillati...
Bioorg Med Chem 19: 2808-16 (2011)
Article DOI: 10.1016/j.bmc.2011.03.052
BindingDB Entry DOI: 10.7270/Q2KW5GB1
Kappa-type opioid receptor
(Homo sapiens (Human))
BDBM50343626
((5alpha)-17-Allyl-14-hydroxy-6-oxo-4,5-epoxymorphi...)
Show SMILES CO[C@@]12CCCC[C@@]11CCN(CC3CCC3)[C@@H]2Cc2ccc(OC(=O)CCCCCCCCC(=O)Oc3ccc4C[C@H]5N(CC=C)CC[C@@]67[C@@H](Oc3c46)C(=O)CC[C@@]57O)cc12 |r,TLB:11:10:18.60.17:2|
Show InChI InChI=1S/C51H66N2O8/c1-3-27-52-29-26-49-45-36-18-20-40(46(45)61-47(49)39(54)21-24-50(49,57)41(52)31-36)60-44(56)16-9-7-5-4-6-8-15-43(55)59-37-19-17-35-30-42-51(58-2)23-11-10-22-48(51,38(35)32-37)25-28-53(42)33-34-13-12-14-34/h3,17-20,32,34,41-42,47,57H,1,4-16,21-31,33H2,2H3/t41-,42-,47+,48+,49+,50-,51-/m1/s1
Reactome pathway
n/an/a 7.70n/an/an/an/an/an/a
Harvard Medical School
Curated by ChEMBL
Assay Description
Antagonist activity at human kappa-opioid receptor expressed in CHO cells assessed as inhibition of U69593-induced [35S]GTPgammaS binding after 60 mi...
Bioorg Med Chem 19: 2808-16 (2011)
Article DOI: 10.1016/j.bmc.2011.03.052
BindingDB Entry DOI: 10.7270/Q2KW5GB1