null
SMILES: Oc1ccccc1NC(=O)c1cnns1
InChI Key: InChIKey=QCZDUQMMGOOKGP-UHFFFAOYSA-N
Activity Spreadsheet -- Enzyme Inhibition Constant Data from BindingDB
Found 1 hit for monomerid = 50343658
Trg + Lig
Ki
nM
ΔG°
kcal/mole
IC50
nM
Kd
nM
EC50/IC50
nM
koff
s-1
kon
M-1s-1
pHTemp
°C
Ribosomal protein S6 kinase alpha-3
(Homo sapiens (Human))
BDBM50343658
(CHEMBL1775073 | N-(2-hydroxyphenyl)-1,2,3-thiadiaz...)
Show SMILES Oc1ccccc1NC(=O)c1cnns1
Show InChI InChI=1S/C9H7N3O2S/c13-7-4-2-1-3-6(7)11-9(14)8-5-10-12-15-8/h1-5,13H,(H,11,14)
Reactome pathway
n/an/a 3.03E+3n/an/an/an/an/an/a
East China University of Science and Technology
Curated by ChEMBL
Assay Description
Inhibition of RSK2 after 60 mins
J Med Chem 54: 3564-74 (2011)
Article DOI: 10.1021/jm200139j
BindingDB Entry DOI: 10.7270/Q26M374H