null
SMILES: CCNC(=O)Nc1ccc(cc1)-c1nc2c(CO[C@]2(C)CCO)c(n1)N1CCOCC1
InChI Key: InChIKey=MMRPGKGGMCYSNW-JOCHJYFZSA-N
Activity Spreadsheet -- Enzyme Inhibition Constant Data from BindingDB
Found 3 hits for monomerid = 50343778
Trg + Lig
Ki
nM
ΔG°
kcal/mole
IC50
nM
Kd
nM
EC50/IC50
nM
koff
s-1
kon
M-1s-1
pHTemp
°C
Serine/threonine-protein kinase mTOR
(Homo sapiens (Human))
BDBM50343778
((R)-1-ethyl-3-(4-(7-(2-hydroxyethyl)-7-methyl-4-mo...)
Show SMILES CCNC(=O)Nc1ccc(cc1)-c1nc2c(CO[C@]2(C)CCO)c(n1)N1CCOCC1 |r|
Show InChI InChI=1S/C22H29N5O4/c1-3-23-21(29)24-16-6-4-15(5-7-16)19-25-18-17(14-31-22(18,2)8-11-28)20(26-19)27-9-12-30-13-10-27/h4-7,28H,3,8-14H2,1-2H3,(H2,23,24,29)/t22-/m1/s1
NCI pathway
Reactome pathway
2.90n/an/an/an/an/an/an/an/a
Genentech
Curated by ChEMBL
Assay Description
Inhibition of human recombinant mTOR expressed in insect cells using 4E-BP1 substrate after 30 mins by fluorescence resonance energy transfer assay
J Med Chem 54: 3426-35 (2011)
Article DOI: 10.1021/jm200215y
BindingDB Entry DOI: 10.7270/Q29C6XRH
Serine/threonine-protein kinase mTOR
(Homo sapiens (Human))
BDBM50343778
((R)-1-ethyl-3-(4-(7-(2-hydroxyethyl)-7-methyl-4-mo...)
Show SMILES CCNC(=O)Nc1ccc(cc1)-c1nc2c(CO[C@]2(C)CCO)c(n1)N1CCOCC1 |r|
Show InChI InChI=1S/C22H29N5O4/c1-3-23-21(29)24-16-6-4-15(5-7-16)19-25-18-17(14-31-22(18,2)8-11-28)20(26-19)27-9-12-30-13-10-27/h4-7,28H,3,8-14H2,1-2H3,(H2,23,24,29)/t22-/m1/s1
NCI pathway
Reactome pathway
n/an/a 47n/an/an/an/an/an/a
Genentech
Curated by ChEMBL
Assay Description
Inhibition of mTOR in human NCI-PC3 cells assessed as inhibition of p70S6k phosphorylation by electrochemiluminescence assay
J Med Chem 54: 3426-35 (2011)
Article DOI: 10.1021/jm200215y
BindingDB Entry DOI: 10.7270/Q29C6XRH
Serine/threonine-protein kinase mTOR
(Homo sapiens (Human))
BDBM50343778
((R)-1-ethyl-3-(4-(7-(2-hydroxyethyl)-7-methyl-4-mo...)
Show SMILES CCNC(=O)Nc1ccc(cc1)-c1nc2c(CO[C@]2(C)CCO)c(n1)N1CCOCC1 |r|
Show InChI InChI=1S/C22H29N5O4/c1-3-23-21(29)24-16-6-4-15(5-7-16)19-25-18-17(14-31-22(18,2)8-11-28)20(26-19)27-9-12-30-13-10-27/h4-7,28H,3,8-14H2,1-2H3,(H2,23,24,29)/t22-/m1/s1
NCI pathway
Reactome pathway
n/an/a 23n/an/an/an/an/an/a
Genentech
Curated by ChEMBL
Assay Description
Inhibition of mTor in human NCI-PC3 cells assessed as inhibition of Akt phosphorylation at serine473 by electrochemiluminescence assay
J Med Chem 54: 3426-35 (2011)
Article DOI: 10.1021/jm200215y
BindingDB Entry DOI: 10.7270/Q29C6XRH