BDBM50344013 CHEMBL1780094::trans-(3R,5S)-N-((6-aminopyridin-2-yl)methyl)-1-((5-methyl-2-phenyloxazol-4-yl)methyl)-5-phenylpiperidine-3-carboxamide
SMILES: Cc1oc(nc1CN1C[C@@H](C[C@H](C1)c1ccccc1)C(=O)NCc1cccc(N)n1)-c1ccccc1
InChI Key: InChIKey=IFORSDHPEMQPSM-DNQXCXABSA-N
Data: 1 IC50
Activity Spreadsheet -- Enzyme Inhibition Constant Data from BindingDB
Found 1 hit for monomerid = 50344013
Trg + Lig
Ki
nM
ΔG°
kcal/mole
IC50
nM
Kd
nM
EC50/IC50
nM
koff
s-1
kon
M-1s-1
pHTemp
°C
High affinity cAMP-specific and IBMX-insensitive 3',5'-cyclic phosphodiesterase 8B
(Homo sapiens (Human))
BDBM50344013
(CHEMBL1780094 | trans-(3R,5S)-N-((6-aminopyridin-2...)
Show SMILES Cc1oc(nc1CN1C[C@@H](C[C@H](C1)c1ccccc1)C(=O)NCc1cccc(N)n1)-c1ccccc1 |r|
Show InChI InChI=1S/C29H31N5O2/c1-20-26(33-29(36-20)22-11-6-3-7-12-22)19-34-17-23(21-9-4-2-5-10-21)15-24(18-34)28(35)31-16-25-13-8-14-27(30)32-25/h2-14,23-24H,15-19H2,1H3,(H2,30,32)(H,31,35)/t23-,24-/m1/s1
Reactome pathway
n/an/a 0.120n/an/an/an/an/an/a
Pfizer Inc.
Curated by ChEMBL
Assay Description
Inhibition of PDE8B
Bioorg Med Chem Lett 21: 3095-8 (2011)
Article DOI: 10.1016/j.bmcl.2011.03.022
BindingDB Entry DOI: 10.7270/Q20002F8