BDBM50344017 1-((5-methyl-2-phenyloxazol-4-yl)methyl)-N-((6-methylpyridin-2-yl)methyl)piperidine-3-carboxamide::CHEMBL1779978
SMILES: Cc1oc(nc1CN1CCCC(C1)C(=O)NCc1cccc(C)n1)-c1ccccc1
InChI Key: InChIKey=WZGVFBPGGTVOPK-UHFFFAOYSA-N
Data: 2 IC50
Activity Spreadsheet -- Enzyme Inhibition Constant Data from BindingDB
Found 2 hits for monomerid = 50344017
Trg + Lig
Ki
nM
ΔG°
kcal/mole
IC50
nM
Kd
nM
EC50/IC50
nM
koff
s-1
kon
M-1s-1
pHTemp
°C
High affinity cAMP-specific and IBMX-insensitive 3',5'-cyclic phosphodiesterase 8B
(Homo sapiens (Human))
BDBM50344017
(1-((5-methyl-2-phenyloxazol-4-yl)methyl)-N-((6-met...)
Show SMILES Cc1oc(nc1CN1CCCC(C1)C(=O)NCc1cccc(C)n1)-c1ccccc1
Show InChI InChI=1S/C24H28N4O2/c1-17-8-6-12-21(26-17)14-25-23(29)20-11-7-13-28(15-20)16-22-18(2)30-24(27-22)19-9-4-3-5-10-19/h3-6,8-10,12,20H,7,11,13-16H2,1-2H3,(H,25,29)
Reactome pathway
n/an/a 240n/an/an/an/an/an/a
Pfizer Inc.
Curated by ChEMBL
Assay Description
Inhibition of PDE8B
Bioorg Med Chem Lett 21: 3095-8 (2011)
Article DOI: 10.1016/j.bmcl.2011.03.022
BindingDB Entry DOI: 10.7270/Q20002F8
High affinity cAMP-specific and IBMX-insensitive 3',5'-cyclic phosphodiesterase 8A
(Homo sapiens (Human))
BDBM50344017
(1-((5-methyl-2-phenyloxazol-4-yl)methyl)-N-((6-met...)
Show SMILES Cc1oc(nc1CN1CCCC(C1)C(=O)NCc1cccc(C)n1)-c1ccccc1
Show InChI InChI=1S/C24H28N4O2/c1-17-8-6-12-21(26-17)14-25-23(29)20-11-7-13-28(15-20)16-22-18(2)30-24(27-22)19-9-4-3-5-10-19/h3-6,8-10,12,20H,7,11,13-16H2,1-2H3,(H,25,29)
Reactome pathway
n/an/a 1.80n/an/an/an/an/an/a
Pfizer Inc.
Curated by ChEMBL
Assay Description
Inhibition of PDE8A
Bioorg Med Chem Lett 21: 3095-8 (2011)
Article DOI: 10.1016/j.bmcl.2011.03.022
BindingDB Entry DOI: 10.7270/Q20002F8