null
SMILES: Cc1noc(n1)[C@@H]1C[C@H](CN(Cc2nc(oc2C)-c2ccccc2)C1)C(=O)NCc1cccc(C)n1
InChI Key: InChIKey=HNAYSIZFEZUKEC-FGZHOGPDSA-N
Activity Spreadsheet -- Enzyme Inhibition Constant Data from BindingDB
Found 1 hit for monomerid = 50344023
Trg + Lig
Ki
nM
ΔG°
kcal/mole
IC50
nM
Kd
nM
EC50/IC50
nM
koff
s-1
kon
M-1s-1
pHTemp
°C
High affinity cAMP-specific and IBMX-insensitive 3',5'-cyclic phosphodiesterase 8B
(Homo sapiens (Human))
BDBM50344023
(CHEMBL1780089 | trans-(3R,5R)-5-(3-methyl-1,2,4-ox...)
Show SMILES Cc1noc(n1)[C@@H]1C[C@H](CN(Cc2nc(oc2C)-c2ccccc2)C1)C(=O)NCc1cccc(C)n1 |r|
Show InChI InChI=1S/C27H30N6O3/c1-17-8-7-11-23(29-17)13-28-25(34)21-12-22(27-30-19(3)32-36-27)15-33(14-21)16-24-18(2)35-26(31-24)20-9-5-4-6-10-20/h4-11,21-22H,12-16H2,1-3H3,(H,28,34)/t21-,22-/m1/s1
Reactome pathway
n/an/a 3.90n/an/an/an/an/an/a
Pfizer Inc.
Curated by ChEMBL
Assay Description
Inhibition of PDE8B
Bioorg Med Chem Lett 21: 3095-8 (2011)
Article DOI: 10.1016/j.bmcl.2011.03.022
BindingDB Entry DOI: 10.7270/Q20002F8