BDBM50344096 2-(3-oxo-1-(3-(trifluoromethyl)phenylsulfonyl)piperazin-2-yl)-N-((R)-6-(piperidin-1-ylmethyl)-1,2,3,4-tetrahydronaphthalen-1-yl)acetamide::CHEMBL1777954
SMILES: FC(F)(F)c1cccc(c1)S(=O)(=O)N1CCNC(=O)C1CC(=O)N[C@@H]1CCCc2cc(CN3CCCCC3)ccc12
InChI Key: InChIKey=KAMGZRDKXXMMEW-DCWQJPKNSA-N
Data: 1 KI  1 IC50
Activity Spreadsheet -- Enzyme Inhibition Constant Data from BindingDB
Found 2 hits for monomerid = 50344096
Trg + Lig
Ki
nM
ΔG°
kcal/mole
IC50
nM
Kd
nM
EC50/IC50
nM
koff
s-1
kon
M-1s-1
pHTemp
°C
Bradykinin B1 receptor
(Homo sapiens (Human))
BDBM50344096
(2-(3-oxo-1-(3-(trifluoromethyl)phenylsulfonyl)pipe...)
Show SMILES FC(F)(F)c1cccc(c1)S(=O)(=O)N1CCNC(=O)C1CC(=O)N[C@@H]1CCCc2cc(CN3CCCCC3)ccc12 |r|
Show InChI InChI=1S/C29H35F3N4O4S/c30-29(31,32)22-7-5-8-23(17-22)41(39,40)36-15-12-33-28(38)26(36)18-27(37)34-25-9-4-6-21-16-20(10-11-24(21)25)19-35-13-2-1-3-14-35/h5,7-8,10-11,16-17,25-26H,1-4,6,9,12-15,18-19H2,(H,33,38)(H,34,37)/t25-,26?/m1/s1
0.150n/an/an/an/an/an/an/an/a
Amgen, Inc.
Curated by ChEMBL
Assay Description
Antagonist activity at human bradykinin B1 receptor
Bioorg Med Chem Lett 21: 3384-9 (2011)
Article DOI: 10.1016/j.bmcl.2011.03.115
BindingDB Entry DOI: 10.7270/Q2FX79R6
Bradykinin B1 receptor
(Homo sapiens (Human))
BDBM50344096
(2-(3-oxo-1-(3-(trifluoromethyl)phenylsulfonyl)pipe...)
Show SMILES FC(F)(F)c1cccc(c1)S(=O)(=O)N1CCNC(=O)C1CC(=O)N[C@@H]1CCCc2cc(CN3CCCCC3)ccc12 |r|
Show InChI InChI=1S/C29H35F3N4O4S/c30-29(31,32)22-7-5-8-23(17-22)41(39,40)36-15-12-33-28(38)26(36)18-27(37)34-25-9-4-6-21-16-20(10-11-24(21)25)19-35-13-2-1-3-14-35/h5,7-8,10-11,16-17,25-26H,1-4,6,9,12-15,18-19H2,(H,33,38)(H,34,37)/t25-,26?/m1/s1
n/an/a 0.940n/an/an/an/an/an/a
Amgen, Inc.
Curated by ChEMBL
Assay Description
Antagonist activity at human bradykinin B1 receptor expressed in CHO cells assessed as inhibition of agonist-induced calcium efflux by aquerin based ...
Bioorg Med Chem Lett 21: 3384-9 (2011)
Article DOI: 10.1016/j.bmcl.2011.03.115
BindingDB Entry DOI: 10.7270/Q2FX79R6