BDBM50344116 CHEMBL1777974::N-((R)-6-((cyclopropylamino)methyl)-1,2,3,4-tetrahydronaphthalen-1-yl)-2-((R)-3-oxo-1-tosylpiperazin-2-yl)acetamide
SMILES: Cc1ccc(cc1)S(=O)(=O)N1CCNC(=O)[C@H]1CC(=O)N[C@@H]1CCCc2cc(CNC3CC3)ccc12
InChI Key: InChIKey=TVFZRPAHOHVFGZ-JWQCQUIFSA-N
Data: 1 KI  1 IC50
Activity Spreadsheet -- Enzyme Inhibition Constant Data from BindingDB
Found 2 hits for monomerid = 50344116
Trg + Lig
Ki
nM
ΔG°
kcal/mole
IC50
nM
Kd
nM
EC50/IC50
nM
koff
s-1
kon
M-1s-1
pHTemp
°C
Bradykinin B1 receptor
(Homo sapiens (Human))
BDBM50344116
(CHEMBL1777974 | N-((R)-6-((cyclopropylamino)methyl...)
Show SMILES Cc1ccc(cc1)S(=O)(=O)N1CCNC(=O)[C@H]1CC(=O)N[C@@H]1CCCc2cc(CNC3CC3)ccc12 |r|
Show InChI InChI=1S/C27H34N4O4S/c1-18-5-10-22(11-6-18)36(34,35)31-14-13-28-27(33)25(31)16-26(32)30-24-4-2-3-20-15-19(7-12-23(20)24)17-29-21-8-9-21/h5-7,10-12,15,21,24-25,29H,2-4,8-9,13-14,16-17H2,1H3,(H,28,33)(H,30,32)/t24-,25-/m1/s1
1.09n/an/an/an/an/an/an/an/a
Amgen, Inc.
Curated by ChEMBL
Assay Description
Antagonist activity at human bradykinin B1 receptor
Bioorg Med Chem Lett 21: 3384-9 (2011)
Article DOI: 10.1016/j.bmcl.2011.03.115
BindingDB Entry DOI: 10.7270/Q2FX79R6
Bradykinin B1 receptor
(Homo sapiens (Human))
BDBM50344116
(CHEMBL1777974 | N-((R)-6-((cyclopropylamino)methyl...)
Show SMILES Cc1ccc(cc1)S(=O)(=O)N1CCNC(=O)[C@H]1CC(=O)N[C@@H]1CCCc2cc(CNC3CC3)ccc12 |r|
Show InChI InChI=1S/C27H34N4O4S/c1-18-5-10-22(11-6-18)36(34,35)31-14-13-28-27(33)25(31)16-26(32)30-24-4-2-3-20-15-19(7-12-23(20)24)17-29-21-8-9-21/h5-7,10-12,15,21,24-25,29H,2-4,8-9,13-14,16-17H2,1H3,(H,28,33)(H,30,32)/t24-,25-/m1/s1
n/an/a 4.30n/an/an/an/an/an/a
Amgen, Inc.
Curated by ChEMBL
Assay Description
Antagonist activity at human bradykinin B1 receptor expressed in CHO cells assessed as inhibition of agonist-induced calcium efflux by aquerin based ...
Bioorg Med Chem Lett 21: 3384-9 (2011)
Article DOI: 10.1016/j.bmcl.2011.03.115
BindingDB Entry DOI: 10.7270/Q2FX79R6