BDBM50344118 CHEMBL1777976::N-((R)-6-((tert-butylamino)methyl)-1,2,3,4-tetrahydronaphthalen-1-yl)-2-((R)-3-oxo-1-tosylpiperazin-2-yl)acetamide
SMILES: Cc1ccc(cc1)S(=O)(=O)N1CCNC(=O)[C@H]1CC(=O)N[C@@H]1CCCc2cc(CNC(C)(C)C)ccc12
InChI Key: InChIKey=SLOODFDSRINSMM-JWQCQUIFSA-N
Data: 1 KI  3 IC50
Activity Spreadsheet -- Enzyme Inhibition Constant Data from BindingDB
Found 4 hits for monomerid = 50344118
Trg + Lig
Ki
nM
ΔG°
kcal/mole
IC50
nM
Kd
nM
EC50/IC50
nM
koff
s-1
kon
M-1s-1
pHTemp
°C
Bradykinin B1 receptor
(Homo sapiens (Human))
BDBM50344118
(CHEMBL1777976 | N-((R)-6-((tert-butylamino)methyl)...)
Show SMILES Cc1ccc(cc1)S(=O)(=O)N1CCNC(=O)[C@H]1CC(=O)N[C@@H]1CCCc2cc(CNC(C)(C)C)ccc12 |r|
Show InChI InChI=1S/C28H38N4O4S/c1-19-8-11-22(12-9-19)37(35,36)32-15-14-29-27(34)25(32)17-26(33)31-24-7-5-6-21-16-20(10-13-23(21)24)18-30-28(2,3)4/h8-13,16,24-25,30H,5-7,14-15,17-18H2,1-4H3,(H,29,34)(H,31,33)/t24-,25-/m1/s1
4.10n/an/an/an/an/an/an/an/a
Amgen, Inc.
Curated by ChEMBL
Assay Description
Antagonist activity at human bradykinin B1 receptor
Bioorg Med Chem Lett 21: 3384-9 (2011)
Article DOI: 10.1016/j.bmcl.2011.03.115
BindingDB Entry DOI: 10.7270/Q2FX79R6
Cytochrome P450 3A4
(Homo sapiens (Human))
BDBM50344118
(CHEMBL1777976 | N-((R)-6-((tert-butylamino)methyl)...)
Show SMILES Cc1ccc(cc1)S(=O)(=O)N1CCNC(=O)[C@H]1CC(=O)N[C@@H]1CCCc2cc(CNC(C)(C)C)ccc12 |r|
Show InChI InChI=1S/C28H38N4O4S/c1-19-8-11-22(12-9-19)37(35,36)32-15-14-29-27(34)25(32)17-26(33)31-24-7-5-6-21-16-20(10-13-23(21)24)18-30-28(2,3)4/h8-13,16,24-25,30H,5-7,14-15,17-18H2,1-4H3,(H,29,34)(H,31,33)/t24-,25-/m1/s1
Reactome pathway
n/an/a>3.00E+4n/an/an/an/an/an/a
Amgen, Inc.
Curated by ChEMBL
Assay Description
Inhibition of CYP3A4 preincubated for 30 mins
Bioorg Med Chem Lett 21: 3384-9 (2011)
Article DOI: 10.1016/j.bmcl.2011.03.115
BindingDB Entry DOI: 10.7270/Q2FX79R6
Cytochrome P450 3A4
(Homo sapiens (Human))
BDBM50344118
(CHEMBL1777976 | N-((R)-6-((tert-butylamino)methyl)...)
Show SMILES Cc1ccc(cc1)S(=O)(=O)N1CCNC(=O)[C@H]1CC(=O)N[C@@H]1CCCc2cc(CNC(C)(C)C)ccc12 |r|
Show InChI InChI=1S/C28H38N4O4S/c1-19-8-11-22(12-9-19)37(35,36)32-15-14-29-27(34)25(32)17-26(33)31-24-7-5-6-21-16-20(10-13-23(21)24)18-30-28(2,3)4/h8-13,16,24-25,30H,5-7,14-15,17-18H2,1-4H3,(H,29,34)(H,31,33)/t24-,25-/m1/s1
Reactome pathway
n/an/a>3.00E+4n/an/an/an/an/an/a
Amgen, Inc.
Curated by ChEMBL
Assay Description
Inhibition of CYP3A4
Bioorg Med Chem Lett 21: 3384-9 (2011)
Article DOI: 10.1016/j.bmcl.2011.03.115
BindingDB Entry DOI: 10.7270/Q2FX79R6
Bradykinin B1 receptor
(Homo sapiens (Human))
BDBM50344118
(CHEMBL1777976 | N-((R)-6-((tert-butylamino)methyl)...)
Show SMILES Cc1ccc(cc1)S(=O)(=O)N1CCNC(=O)[C@H]1CC(=O)N[C@@H]1CCCc2cc(CNC(C)(C)C)ccc12 |r|
Show InChI InChI=1S/C28H38N4O4S/c1-19-8-11-22(12-9-19)37(35,36)32-15-14-29-27(34)25(32)17-26(33)31-24-7-5-6-21-16-20(10-13-23(21)24)18-30-28(2,3)4/h8-13,16,24-25,30H,5-7,14-15,17-18H2,1-4H3,(H,29,34)(H,31,33)/t24-,25-/m1/s1
n/an/a 1.28n/an/an/an/an/an/a
Amgen, Inc.
Curated by ChEMBL
Assay Description
Antagonist activity at human bradykinin B1 receptor expressed in CHO cells assessed as inhibition of agonist-induced calcium efflux by aquerin based ...
Bioorg Med Chem Lett 21: 3384-9 (2011)
Article DOI: 10.1016/j.bmcl.2011.03.115
BindingDB Entry DOI: 10.7270/Q2FX79R6