BDBM50344131 6-(2,4-difluorophenoxy)-N-isopropyl-1H-pyrazolo[3,4-d]pyrimidin-3-amine::CHEMBL1778105
SMILES: CC(C)Nc1[nH]nc2nc(Oc3ccc(F)cc3F)ncc12
InChI Key: InChIKey=AIMLQKVGYXQMSZ-UHFFFAOYSA-N
Data: 1 IC50
Activity Spreadsheet -- Enzyme Inhibition Constant Data from BindingDB
Found 1 hit for monomerid = 50344131
Trg + Lig
Ki
nM
ΔG°
kcal/mole
IC50
nM
Kd
nM
EC50/IC50
nM
koff
s-1
kon
M-1s-1
pHTemp
°C
Mitogen-activated protein kinase 14
(Homo sapiens (Human))
BDBM50344131
(6-(2,4-difluorophenoxy)-N-isopropyl-1H-pyrazolo[3,...)
Show SMILES CC(C)Nc1[nH]nc2nc(Oc3ccc(F)cc3F)ncc12
Show InChI InChI=1S/C14H13F2N5O/c1-7(2)18-12-9-6-17-14(19-13(9)21-20-12)22-11-4-3-8(15)5-10(11)16/h3-7H,1-2H3,(H2,17,18,19,20,21)
NCI pathway
Reactome pathway
n/an/a 23n/an/an/an/an/an/a
Roche Palo Alto
Curated by ChEMBL
Assay Description
Inhibition of p38alpha assessed as [33P]gamma-ATP incorporation into myelin basic protein
Bioorg Med Chem Lett 21: 3452-6 (2011)
Article DOI: 10.1016/j.bmcl.2011.03.098
BindingDB Entry DOI: 10.7270/Q26H4HR7