BDBM50344134 CHEMBL1778102::N-(6-(2,4-difluorophenoxy)-1H-pyrazolo[3,4-d]pyrimidin-3-yl)cyclobutanecarboxamide
SMILES: Fc1ccc(Oc2ncc3c(NC(=O)C4CCC4)[nH]nc3n2)c(F)c1
InChI Key: InChIKey=OSVQYJBSSATJGP-UHFFFAOYSA-N
Data: 1 IC50
Activity Spreadsheet -- Enzyme Inhibition Constant Data from BindingDB
Found 1 hit for monomerid = 50344134
Trg + Lig
Ki
nM
ΔG°
kcal/mole
IC50
nM
Kd
nM
EC50/IC50
nM
koff
s-1
kon
M-1s-1
pHTemp
°C
Mitogen-activated protein kinase 14
(Homo sapiens (Human))
BDBM50344134
(CHEMBL1778102 | N-(6-(2,4-difluorophenoxy)-1H-pyra...)
Show SMILES Fc1ccc(Oc2ncc3c(NC(=O)C4CCC4)[nH]nc3n2)c(F)c1
Show InChI InChI=1S/C16H13F2N5O2/c17-9-4-5-12(11(18)6-9)25-16-19-7-10-13(22-23-14(10)21-16)20-15(24)8-2-1-3-8/h4-8H,1-3H2,(H2,19,20,21,22,23,24)
NCI pathway
Reactome pathway
n/an/a 59n/an/an/an/an/an/a
Roche Palo Alto
Curated by ChEMBL
Assay Description
Inhibition of p38alpha assessed as [33P]gamma-ATP incorporation into myelin basic protein
Bioorg Med Chem Lett 21: 3452-6 (2011)
Article DOI: 10.1016/j.bmcl.2011.03.098
BindingDB Entry DOI: 10.7270/Q26H4HR7