BDBM50344161 2-((R)-7-((R)-2-(4-fluorophenyl)-N-methylpropanamido)-6,7,8,9-tetrahydropyrido[1,2-a]indol-10-yl)acetic acid::CHEMBL1778387
SMILES: C[C@@H](C(=O)N(C)[C@@H]1CCc2c(CC(O)=O)c3ccccc3n2C1)c1ccc(F)cc1
InChI Key: InChIKey=OJEQIOOQKHUSKG-CRAIPNDOSA-N
Data: 1 KI  3 IC50
Activity Spreadsheet -- Enzyme Inhibition Constant Data from BindingDB
Found 4 hits for monomerid = 50344161
Trg + Lig
Ki
nM
ΔG°
kcal/mole
IC50
nM
Kd
nM
EC50/IC50
nM
koff
s-1
kon
M-1s-1
pHTemp
°C
G protein-coupled receptor 44
(Homo sapiens (Human))
BDBM50344161
(2-((R)-7-((R)-2-(4-fluorophenyl)-N-methylpropanami...)
Show SMILES C[C@@H](C(=O)N(C)[C@@H]1CCc2c(CC(O)=O)c3ccccc3n2C1)c1ccc(F)cc1 |r|
Show InChI InChI=1S/C24H25FN2O3/c1-15(16-7-9-17(25)10-8-16)24(30)26(2)18-11-12-22-20(13-23(28)29)19-5-3-4-6-21(19)27(22)14-18/h3-10,15,18H,11-14H2,1-2H3,(H,28,29)/t15-,18-/m1/s1
Reactome pathway
4n/an/an/an/an/an/an/an/a
Merck Frosst
Curated by ChEMBL
Assay Description
Binding affinity to human CRTH2 receptor expressed in HEK293-EBNA cells by radioligand competition binding assay
Bioorg Med Chem Lett 21: 3471-4 (2011)
Article DOI: 10.1016/j.bmcl.2011.03.085
BindingDB Entry DOI: 10.7270/Q2T72HSR
Cytochrome P450 2C9
(Homo sapiens (Human))
BDBM50344161
(2-((R)-7-((R)-2-(4-fluorophenyl)-N-methylpropanami...)
Show SMILES C[C@@H](C(=O)N(C)[C@@H]1CCc2c(CC(O)=O)c3ccccc3n2C1)c1ccc(F)cc1 |r|
Show InChI InChI=1S/C24H25FN2O3/c1-15(16-7-9-17(25)10-8-16)24(30)26(2)18-11-12-22-20(13-23(28)29)19-5-3-4-6-21(19)27(22)14-18/h3-10,15,18H,11-14H2,1-2H3,(H,28,29)/t15-,18-/m1/s1
Reactome pathway
n/an/a>5.00E+4n/an/an/an/an/an/a
Merck Frosst
Curated by ChEMBL
Assay Description
Inhibition of CYP2C9
Bioorg Med Chem Lett 21: 3471-4 (2011)
Article DOI: 10.1016/j.bmcl.2011.03.085
BindingDB Entry DOI: 10.7270/Q2T72HSR
Cytochrome P450 3A4
(Homo sapiens (Human))
BDBM50344161
(2-((R)-7-((R)-2-(4-fluorophenyl)-N-methylpropanami...)
Show SMILES C[C@@H](C(=O)N(C)[C@@H]1CCc2c(CC(O)=O)c3ccccc3n2C1)c1ccc(F)cc1 |r|
Show InChI InChI=1S/C24H25FN2O3/c1-15(16-7-9-17(25)10-8-16)24(30)26(2)18-11-12-22-20(13-23(28)29)19-5-3-4-6-21(19)27(22)14-18/h3-10,15,18H,11-14H2,1-2H3,(H,28,29)/t15-,18-/m1/s1
Reactome pathway
n/an/a>5.00E+4n/an/an/an/an/an/a
Merck Frosst
Curated by ChEMBL
Assay Description
Inhibition of CYP3A4
Bioorg Med Chem Lett 21: 3471-4 (2011)
Article DOI: 10.1016/j.bmcl.2011.03.085
BindingDB Entry DOI: 10.7270/Q2T72HSR
G protein-coupled receptor 44
(Homo sapiens (Human))
BDBM50344161
(2-((R)-7-((R)-2-(4-fluorophenyl)-N-methylpropanami...)
Show SMILES C[C@@H](C(=O)N(C)[C@@H]1CCc2c(CC(O)=O)c3ccccc3n2C1)c1ccc(F)cc1 |r|
Show InChI InChI=1S/C24H25FN2O3/c1-15(16-7-9-17(25)10-8-16)24(30)26(2)18-11-12-22-20(13-23(28)29)19-5-3-4-6-21(19)27(22)14-18/h3-10,15,18H,11-14H2,1-2H3,(H,28,29)/t15-,18-/m1/s1
Reactome pathway
n/an/a 3n/an/an/an/an/an/a
Merck Frosst
Curated by ChEMBL
Assay Description
Antagonist activity at human CRTH2 receptor expressed in HEK293-EBNA cells assessed as inhibition of forskolin-stimulated intracellular cAMP producti...
Bioorg Med Chem Lett 21: 3471-4 (2011)
Article DOI: 10.1016/j.bmcl.2011.03.085
BindingDB Entry DOI: 10.7270/Q2T72HSR