BDBM50344191 (S)-2-(1-((S)-1-carboxy-2-(5-phenyloxazol-2-yl)ethylcarbamoyl)cyclopentylamino)pentanoic acid::CHEMBL1778530
SMILES: CCC[C@H](NC1(CCCC1)C(=O)N[C@@H](Cc1ncc(o1)-c1ccccc1)C(O)=O)C(O)=O
InChI Key: InChIKey=DQULGQNMFILGNZ-IRXDYDNUSA-N
Data: 2 IC50
Activity Spreadsheet -- Enzyme Inhibition Constant Data from BindingDB
Found 2 hits for monomerid = 50344191
Trg + Lig
Ki
nM
ΔG°
kcal/mole
IC50
nM
Kd
nM
EC50/IC50
nM
koff
s-1
kon
M-1s-1
pHTemp
°C
Atrial natriuretic factor
(Homo sapiens (Human))
BDBM50344191
((S)-2-(1-((S)-1-carboxy-2-(5-phenyloxazol-2-yl)eth...)
Show SMILES CCC[C@H](NC1(CCCC1)C(=O)N[C@@H](Cc1ncc(o1)-c1ccccc1)C(O)=O)C(O)=O |r|
Show InChI InChI=1S/C23H29N3O6/c1-2-8-16(20(27)28)26-23(11-6-7-12-23)22(31)25-17(21(29)30)13-19-24-14-18(32-19)15-9-4-3-5-10-15/h3-5,9-10,14,16-17,26H,2,6-8,11-13H2,1H3,(H,25,31)(H,27,28)(H,29,30)/t16-,17-/m0/s1
Reactome pathway
n/an/a 82n/an/an/an/an/an/a
Pfizer Inc.
Curated by ChEMBL
Assay Description
Inhibition of atrial natriuretic peptide
Bioorg Med Chem Lett 21: 3404-6 (2011)
Article DOI: 10.1016/j.bmcl.2011.03.109
BindingDB Entry DOI: 10.7270/Q2PG1S2F
Neprilysin
(Homo sapiens (Human))
BDBM50344191
((S)-2-(1-((S)-1-carboxy-2-(5-phenyloxazol-2-yl)eth...)
Show SMILES CCC[C@H](NC1(CCCC1)C(=O)N[C@@H](Cc1ncc(o1)-c1ccccc1)C(O)=O)C(O)=O |r|
Show InChI InChI=1S/C23H29N3O6/c1-2-8-16(20(27)28)26-23(11-6-7-12-23)22(31)25-17(21(29)30)13-19-24-14-18(32-19)15-9-4-3-5-10-15/h3-5,9-10,14,16-17,26H,2,6-8,11-13H2,1H3,(H,25,31)(H,27,28)(H,29,30)/t16-,17-/m0/s1
n/an/a 0.600n/an/an/an/an/an/a
Pfizer Inc.
Curated by ChEMBL
Assay Description
Inhibition of neutral endopeptidase
Bioorg Med Chem Lett 21: 3404-6 (2011)
Article DOI: 10.1016/j.bmcl.2011.03.109
BindingDB Entry DOI: 10.7270/Q2PG1S2F