BDBM50344264 CHEMBL1779016::N-((5-(4-fluoro-2-methoxyphenyl)pyridin-3-yl)methyl)cyclobutanecarboxamide
SMILES: COc1cc(F)ccc1-c1cncc(CNC(=O)C2CCC2)c1
InChI Key: InChIKey=PZPUPNNUWKSLFK-UHFFFAOYSA-N
Data: 1 KI  1 IC50
Activity Spreadsheet -- Enzyme Inhibition Constant Data from BindingDB
Found 2 hits for monomerid = 50344264
Trg + Lig
Ki
nM
ΔG°
kcal/mole
IC50
nM
Kd
nM
EC50/IC50
nM
koff
s-1
kon
M-1s-1
pHTemp
°C
Glutamate receptor ionotropic, NMDA 2B
(Rattus norvegicus (Rat))
BDBM50344264
(CHEMBL1779016 | N-((5-(4-fluoro-2-methoxyphenyl)py...)
Show SMILES COc1cc(F)ccc1-c1cncc(CNC(=O)C2CCC2)c1
Show InChI InChI=1S/C18H19FN2O2/c1-23-17-8-15(19)5-6-16(17)14-7-12(9-20-11-14)10-21-18(22)13-3-2-4-13/h5-9,11,13H,2-4,10H2,1H3,(H,21,22)
340n/an/an/an/an/an/an/an/a
AstraZeneca Pharmaceuticals
Curated by ChEMBL
Assay Description
Displacement of [3H]CP101606 from NR2B in rat brain minus cerebellum membrane
Bioorg Med Chem Lett 21: 3399-403 (2011)
Article DOI: 10.1016/j.bmcl.2011.03.117
BindingDB Entry DOI: 10.7270/Q29887BK
Potassium voltage-gated channel subfamily H member 2
(Homo sapiens (Human))
BDBM50344264
(CHEMBL1779016 | N-((5-(4-fluoro-2-methoxyphenyl)py...)
Show SMILES COc1cc(F)ccc1-c1cncc(CNC(=O)C2CCC2)c1
Show InChI InChI=1S/C18H19FN2O2/c1-23-17-8-15(19)5-6-16(17)14-7-12(9-20-11-14)10-21-18(22)13-3-2-4-13/h5-9,11,13H,2-4,10H2,1H3,(H,21,22)
Reactome pathway
n/an/a 1.86E+4n/an/an/an/an/an/a
AstraZeneca Pharmaceuticals
Curated by ChEMBL
Assay Description
Inhibition of human ERG expressed in CHOK1 cells electrophysiology study
Bioorg Med Chem Lett 21: 3399-403 (2011)
Article DOI: 10.1016/j.bmcl.2011.03.117
BindingDB Entry DOI: 10.7270/Q29887BK