BDBM50344307 (S)-6-(2-isopropylpyrazolo[1,5-a]pyridin-3-yl)-5-methyl-4,5-dihydropyridazin-3(2H)-one::CHEMBL1779426
SMILES: CC(C)c1nn2ccccc2c1C1=NNC(=O)C[C@@H]1C
InChI Key: InChIKey=FBMGIJYUJOIVIO-JTQLQIEISA-N
Data: 3 IC50
Activity Spreadsheet -- Enzyme Inhibition Constant Data from BindingDB
Found 3 hits for monomerid = 50344307
Trg + Lig
Ki
nM
ΔG°
kcal/mole
IC50
nM
Kd
nM
EC50/IC50
nM
koff
s-1
kon
M-1s-1
pHTemp
°C
cGMP-specific 3',5'-cyclic phosphodiesterase
(Homo sapiens (Human))
BDBM50344307
((S)-6-(2-isopropylpyrazolo[1,5-a]pyridin-3-yl)-5-m...)
Show SMILES CC(C)c1nn2ccccc2c1C1=NNC(=O)C[C@@H]1C |r,t:14|
Show InChI InChI=1S/C15H18N4O/c1-9(2)14-13(11-6-4-5-7-19(11)18-14)15-10(3)8-12(20)16-17-15/h4-7,9-10H,8H2,1-3H3,(H,16,20)/t10-/m0/s1
Reactome pathway
n/an/a>4.00E+5n/an/an/an/an/an/a
Heriot-Watt University
Curated by ChEMBL
Assay Description
Inhibition of human PDE5A catalytic domain using cAMP/cGMP substrate
Bioorg Med Chem Lett 21: 3307-12 (2011)
Article DOI: 10.1016/j.bmcl.2011.04.021
BindingDB Entry DOI: 10.7270/Q2X067C3
Phosphodiesterase 3 (PDE3)
(Homo sapiens (Human))
BDBM50344307
((S)-6-(2-isopropylpyrazolo[1,5-a]pyridin-3-yl)-5-m...)
Show SMILES CC(C)c1nn2ccccc2c1C1=NNC(=O)C[C@@H]1C |r,t:14|
Show InChI InChI=1S/C15H18N4O/c1-9(2)14-13(11-6-4-5-7-19(11)18-14)15-10(3)8-12(20)16-17-15/h4-7,9-10H,8H2,1-3H3,(H,16,20)/t10-/m0/s1
Reactome pathway
n/an/a>4.00E+5n/an/an/an/an/an/a
Heriot-Watt University
Curated by ChEMBL
Assay Description
Inhibition of human PDE3A catalytic domain using cAMP/cGMP substrate
Bioorg Med Chem Lett 21: 3307-12 (2011)
Article DOI: 10.1016/j.bmcl.2011.04.021
BindingDB Entry DOI: 10.7270/Q2X067C3
3',5'-cyclic phosphodiesterase
(Homo sapiens (Human))
BDBM50344307
((S)-6-(2-isopropylpyrazolo[1,5-a]pyridin-3-yl)-5-m...)
Show SMILES CC(C)c1nn2ccccc2c1C1=NNC(=O)C[C@@H]1C |r,t:14|
Show InChI InChI=1S/C15H18N4O/c1-9(2)14-13(11-6-4-5-7-19(11)18-14)15-10(3)8-12(20)16-17-15/h4-7,9-10H,8H2,1-3H3,(H,16,20)/t10-/m0/s1
n/an/a 1.60E+4n/an/an/an/an/an/a
Heriot-Watt University
Curated by ChEMBL
Assay Description
Inhibition of human PDE4B catalytic domain using cAMP/cGMP substrate
Bioorg Med Chem Lett 21: 3307-12 (2011)
Article DOI: 10.1016/j.bmcl.2011.04.021
BindingDB Entry DOI: 10.7270/Q2X067C3