BDBM50344445 CHEMBL1780014::N-(3-(1-(2-(2-(3-butoxyphenyl)quinoline-4-carbonyl)hydrazono)ethyl)phenyl)pivalamide
SMILES: CCCCOc1cccc(c1)-c1cc(C(=O)NN=C(C)c2cccc(NC(=O)C(C)(C)C)c2)c2ccccc2n1
InChI Key: InChIKey=RGDPOJDURVPVNC-UHFFFAOYSA-N
Data: 1 KI  1 IC50
Activity Spreadsheet -- Enzyme Inhibition Constant Data from BindingDB
Found 2 hits for monomerid = 50344445
Trg + Lig
Ki
nM
ΔG°
kcal/mole
IC50
nM
Kd
nM
EC50/IC50
nM
koff
s-1
kon
M-1s-1
pHTemp
°C
Plasmepsin 2
(Plasmodium falciparum)
BDBM50344445
(CHEMBL1780014 | N-(3-(1-(2-(2-(3-butoxyphenyl)quin...)
Show SMILES CCCCOc1cccc(c1)-c1cc(C(=O)NN=C(C)c2cccc(NC(=O)C(C)(C)C)c2)c2ccccc2n1 |w:17.17|
Show InChI InChI=1S/C33H36N4O3/c1-6-7-18-40-26-15-11-13-24(20-26)30-21-28(27-16-8-9-17-29(27)35-30)31(38)37-36-22(2)23-12-10-14-25(19-23)34-32(39)33(3,4)5/h8-17,19-21H,6-7,18H2,1-5H3,(H,34,39)(H,37,38)
8.00E+3n/an/an/an/an/an/an/an/a
Trinity College
Curated by ChEMBL
Assay Description
Inhibition of Plasmodium falciparum plasmepsin 2 using DABCYL-Glu-Arg-Nle-Phe-Leu- Ser-Phe-Pro-EDANS fluorogenic substrate by fluorogenic assay
Bioorg Med Chem Lett 21: 3335-41 (2011)
Article DOI: 10.1016/j.bmcl.2011.04.015
BindingDB Entry DOI: 10.7270/Q24J0FFK
Plasmepsin 2
(Plasmodium falciparum)
BDBM50344445
(CHEMBL1780014 | N-(3-(1-(2-(2-(3-butoxyphenyl)quin...)
Show SMILES CCCCOc1cccc(c1)-c1cc(C(=O)NN=C(C)c2cccc(NC(=O)C(C)(C)C)c2)c2ccccc2n1 |w:17.17|
Show InChI InChI=1S/C33H36N4O3/c1-6-7-18-40-26-15-11-13-24(20-26)30-21-28(27-16-8-9-17-29(27)35-30)31(38)37-36-22(2)23-12-10-14-25(19-23)34-32(39)33(3,4)5/h8-17,19-21H,6-7,18H2,1-5H3,(H,34,39)(H,37,38)
n/an/a 1.15E+4n/an/an/an/an/an/a
Trinity College
Curated by ChEMBL
Assay Description
Inhibition of Plasmodium falciparum plasmepsin 2 using DABCYL-Glu-Arg-Nle-Phe-Leu- Ser-Phe-Pro-EDANS fluorogenic substrate by fluorogenic assay
Bioorg Med Chem Lett 21: 3335-41 (2011)
Article DOI: 10.1016/j.bmcl.2011.04.015
BindingDB Entry DOI: 10.7270/Q24J0FFK