BDBM50344449 CHEMBL1780018::ethyl 4-(5-(4-tert-butylbenzylidene)-2-(4-(ethoxycarbonyl)phenylimino)-4-oxothiazolidin-3-yl)benzoate
SMILES: CCOC(=O)c1ccc(cc1)\N=C1/S\C(=C/c2ccc(cc2)C(C)(C)C)C(=O)N1c1ccc(cc1)C(=O)OCC
InChI Key: InChIKey=QCISUUVOXYXVPI-ACGZYKHZSA-N
Data: 1 KI  1 IC50
Activity Spreadsheet -- Enzyme Inhibition Constant Data from BindingDB
Found 2 hits for monomerid = 50344449
Trg + Lig
Ki
nM
ΔG°
kcal/mole
IC50
nM
Kd
nM
EC50/IC50
nM
koff
s-1
kon
M-1s-1
pHTemp
°C
Plasmepsin 2
(Plasmodium falciparum)
BDBM50344449
(CHEMBL1780018 | ethyl 4-(5-(4-tert-butylbenzyliden...)
Show SMILES CCOC(=O)c1ccc(cc1)\N=C1/S\C(=C/c2ccc(cc2)C(C)(C)C)C(=O)N1c1ccc(cc1)C(=O)OCC
Show InChI InChI=1S/C32H32N2O5S/c1-6-38-29(36)22-10-16-25(17-11-22)33-31-34(26-18-12-23(13-19-26)30(37)39-7-2)28(35)27(40-31)20-21-8-14-24(15-9-21)32(3,4)5/h8-20H,6-7H2,1-5H3/b27-20-,33-31-
4.00E+3n/an/an/an/an/an/an/an/a
Trinity College
Curated by ChEMBL
Assay Description
Inhibition of Plasmodium falciparum plasmepsin 2 using DABCYL-Glu-Arg-Nle-Phe-Leu- Ser-Phe-Pro-EDANS fluorogenic substrate by fluorogenic assay
Bioorg Med Chem Lett 21: 3335-41 (2011)
Article DOI: 10.1016/j.bmcl.2011.04.015
BindingDB Entry DOI: 10.7270/Q24J0FFK
Plasmepsin 2
(Plasmodium falciparum)
BDBM50344449
(CHEMBL1780018 | ethyl 4-(5-(4-tert-butylbenzyliden...)
Show SMILES CCOC(=O)c1ccc(cc1)\N=C1/S\C(=C/c2ccc(cc2)C(C)(C)C)C(=O)N1c1ccc(cc1)C(=O)OCC
Show InChI InChI=1S/C32H32N2O5S/c1-6-38-29(36)22-10-16-25(17-11-22)33-31-34(26-18-12-23(13-19-26)30(37)39-7-2)28(35)27(40-31)20-21-8-14-24(15-9-21)32(3,4)5/h8-20H,6-7H2,1-5H3/b27-20-,33-31-
n/an/a 6.10E+3n/an/an/an/an/an/a
Trinity College
Curated by ChEMBL
Assay Description
Inhibition of Plasmodium falciparum plasmepsin 2 using DABCYL-Glu-Arg-Nle-Phe-Leu- Ser-Phe-Pro-EDANS fluorogenic substrate by fluorogenic assay
Bioorg Med Chem Lett 21: 3335-41 (2011)
Article DOI: 10.1016/j.bmcl.2011.04.015
BindingDB Entry DOI: 10.7270/Q24J0FFK