null
SMILES: CCCCc1ccc(Nc2nc3cc(Oc4ccnc(c4)C(=O)NC)ccc3o2)cc1
InChI Key: InChIKey=GXPOEXFHJJEOLO-UHFFFAOYSA-N
Activity Spreadsheet -- Enzyme Inhibition Constant Data from BindingDB
Found 1 hit for monomerid = 50344539
Trg + Lig
Ki
nM
ΔG°
kcal/mole
IC50
nM
Kd
nM
EC50/IC50
nM
koff
s-1
kon
M-1s-1
pHTemp
°C
RAF proto-oncogene serine/threonine-protein kinase
(Homo sapiens (Human))
BDBM50344539
(4-(2-(4-butylphenylamino)benzo[d]oxazol-5-yloxy)-N...)
Show SMILES CCCCc1ccc(Nc2nc3cc(Oc4ccnc(c4)C(=O)NC)ccc3o2)cc1
Show InChI InChI=1S/C24H24N4O3/c1-3-4-5-16-6-8-17(9-7-16)27-24-28-20-14-18(10-11-22(20)31-24)30-19-12-13-26-21(15-19)23(29)25-2/h6-15H,3-5H2,1-2H3,(H,25,29)(H,27,28)
NCI pathway
Reactome pathway
n/an/a 2n/an/an/an/an/an/a
Novartis Institutes for Biomedical Research
Curated by ChEMBL
Assay Description
Inhibition of c-Raf assessed as phosphorylation of MEK1/2 by ELISA
Bioorg Med Chem Lett 21: 3286-9 (2011)
Article DOI: 10.1016/j.bmcl.2011.04.023
BindingDB Entry DOI: 10.7270/Q2R78FH0