BDBM50344656 CHEMBL1779194::N-(2-(3-cyano-6,6-dimethyl-11-oxo-6,11-dihydro-5H-benzo[b]carbazol-8-yloxy)ethyl)acetamide
SMILES: CC(=O)NCCOc1ccc2C(=O)c3c([nH]c4cc(ccc34)C#N)C(C)(C)c2c1
InChI Key: InChIKey=JBVFMIKHPRYXDF-UHFFFAOYSA-N
Data: 1 IC50
Activity Spreadsheet -- Enzyme Inhibition Constant Data from BindingDB
Found 1 hit for monomerid = 50344656
Trg + Lig
Ki
nM
ΔG°
kcal/mole
IC50
nM
Kd
nM
EC50/IC50
nM
koff
s-1
kon
M-1s-1
pHTemp
°C
ALK tyrosine kinase receptor
(Homo sapiens (Human))
BDBM50344656
(CHEMBL1779194 | N-(2-(3-cyano-6,6-dimethyl-11-oxo-...)
Show SMILES CC(=O)NCCOc1ccc2C(=O)c3c([nH]c4cc(ccc34)C#N)C(C)(C)c2c1
Show InChI InChI=1S/C23H21N3O3/c1-13(27)25-8-9-29-15-5-7-16-18(11-15)23(2,3)22-20(21(16)28)17-6-4-14(12-24)10-19(17)26-22/h4-7,10-11,26H,8-9H2,1-3H3,(H,25,27)
n/an/a 11.6n/an/an/an/an/an/a
Chugai Pharmaceutical Co. Ltd.
Curated by ChEMBL
Assay Description
Inhibition of ALK assessed as biotin-EGPWLEEEEEAYGWMDF peptide phosphorylation by TR-FRET assay
Bioorg Med Chem Lett 21: 3788-93 (2011)
Checked by Author
Article DOI: 10.1016/j.bmcl.2011.04.020
BindingDB Entry DOI: 10.7270/Q2Q81DF2