BDBM50344660 8-(4-hydroxypiperidin-1-yl)-6,6-dimethyl-11-oxo-6,11-dihydro-5H-benzo[b]carbazole-3-carbonitrile::CHEMBL1779198
SMILES: CC1(C)c2[nH]c3cc(ccc3c2C(=O)c2ccc(cc12)N1CCC(O)CC1)C#N
InChI Key: InChIKey=GLSLTGYOLWHGHV-UHFFFAOYSA-N
Data: 1 IC50
Activity Spreadsheet -- Enzyme Inhibition Constant Data from BindingDB
Found 1 hit for monomerid = 50344660
Trg + Lig
Ki
nM
ΔG°
kcal/mole
IC50
nM
Kd
nM
EC50/IC50
nM
koff
s-1
kon
M-1s-1
pHTemp
°C
ALK tyrosine kinase receptor
(Homo sapiens (Human))
BDBM50344660
(8-(4-hydroxypiperidin-1-yl)-6,6-dimethyl-11-oxo-6,...)
Show SMILES CC1(C)c2[nH]c3cc(ccc3c2C(=O)c2ccc(cc12)N1CCC(O)CC1)C#N
Show InChI InChI=1S/C24H23N3O2/c1-24(2)19-12-15(27-9-7-16(28)8-10-27)4-6-17(19)22(29)21-18-5-3-14(13-25)11-20(18)26-23(21)24/h3-6,11-12,16,26,28H,7-10H2,1-2H3
n/an/a 11.4n/an/an/an/an/an/a
Chugai Pharmaceutical Co. Ltd.
Curated by ChEMBL
Assay Description
Inhibition of ALK assessed as biotin-EGPWLEEEEEAYGWMDF peptide phosphorylation by TR-FRET assay
Bioorg Med Chem Lett 21: 3788-93 (2011)
Checked by Author
Article DOI: 10.1016/j.bmcl.2011.04.020
BindingDB Entry DOI: 10.7270/Q2Q81DF2