BDBM50344787 (R)-4-(3-amino-4-(2,4,5-trifluorophenyl)butanoyl)-1-(2-chlorobenzyl)piperazin-2-one::CHEMBL1779703
SMILES: N[C@@H](CC(=O)N1CCN(Cc2ccccc2Cl)C(=O)C1)Cc1cc(F)c(F)cc1F
InChI Key: InChIKey=IPJNTMRIXXBAIG-OAHLLOKOSA-N
Data: 1 IC50
Activity Spreadsheet -- Enzyme Inhibition Constant Data from BindingDB
Found 1 hit for monomerid = 50344787
Trg + Lig
Ki
nM
ΔG°
kcal/mole
IC50
nM
Kd
nM
EC50/IC50
nM
koff
s-1
kon
M-1s-1
pHTemp
°C
Dipeptidyl peptidase 4
(Homo sapiens (Human))
BDBM50344787
((R)-4-(3-amino-4-(2,4,5-trifluorophenyl)butanoyl)-...)
Show SMILES N[C@@H](CC(=O)N1CCN(Cc2ccccc2Cl)C(=O)C1)Cc1cc(F)c(F)cc1F |r|
Show InChI InChI=1S/C21H21ClF3N3O2/c22-16-4-2-1-3-13(16)11-27-5-6-28(12-21(27)30)20(29)9-15(26)7-14-8-18(24)19(25)10-17(14)23/h1-4,8,10,15H,5-7,9,11-12,26H2/t15-/m1/s1
Reactome pathway
n/an/a 29n/an/an/an/an/an/a
Dong-A Pharm. Co., Ltd
Curated by ChEMBL
Assay Description
Inhibition of recombinant human DPP-4 assessed as H-Gly-Pro-AMC cleavage after 1 hr by fluorescence assay
Bioorg Med Chem Lett 21: 3809-12 (2011)
Article DOI: 10.1016/j.bmcl.2011.04.029
BindingDB Entry DOI: 10.7270/Q2XS5VQK